{"text_format":"3","workbook":"xlsx","n_sheets":5,"sheets":["Wnioski","Dane","Zestawienie","Punktacja","Wykonawcy"],"not_rendered":{"macros":1,"defined_names":1},"read":"whole","date_system":"1900"}

{"sheet":"Wnioski","index":0,"n_rows":12,"n_cols":21,"rows_kept":12}
["Nr ","Przedmiot ","Osoba","Kwota netto","Kwota Euro","Czy EUR OK","Kwota brutto","Czy brutto OK","Kryterium 1","Waga 1","R/M 1","Kryterium 2","Waga 2","R/M 2","Kryterium 3","Waga 3","R/M 3","Kryterium 4","Waga 4","R/M 4","Suma kryteriów"]
[1,"warsztaty kompetencji miekkich","E.Frelichowska",{"v":32520.33,"d":"32,520.33 zł"},{"v":7789.49,"d":"€ 7,789.49"},{"$f":"IF(ROUND(D2/4.1749,2)=E2, \"OK\",ROUND(D2/4.1749,2))","v":"OK"},{"v":40000,"d":"40,000.00 zł"},{"$f":"IF(G2>ROUND(D2*1.23,2),\"OK\",IF(G2=ROUND(D2*1.23,2),\"OK\",ROUND(D2*1.23,2)))","v":{"v":40000.01,"d":"40,000.01 zł"}},"Cena - ",50,"M","Doświadczenie trenera w realizacji szkolen/warsztetów interpersonalnych ( w godzinach)",40,"R","Termin przeprowadzenia I Warsztatu  (w dniach)",10,"M",{"$nulls":3},{"$f":"IF(J2+M2+P2+S2=100,\"OK\",IF(J2+M2+P2+S2>100,J2+M2+P2+S2-100&\" za dużo\",100-(J2+M2+P2+S2)&\" za mało\"))","v":"OK"}]
[2,{"$nulls":4},{"$f":"IF(ROUND(D3/4.1749,2)=E3, \"OK\",ROUND(D3/4.1749,2))","v":"OK"},null,{"$f":"IF(G3>ROUND(D3*1.23,2),\"OK\",IF(G3=ROUND(D3*1.23,2),\"OK\",ROUND(D3*1.23,2)))","v":"OK"},"Cena - ",60,"M",{"$nulls":9},"40 za mało"]
[3,{"$nulls":4},"OK",null,"OK","Cena - ",60,"M",{"$nulls":9},"40 za mało"]
[4,{"$nulls":4},"OK",null,"OK","Cena - ",60,"M",{"$nulls":9},"40 za mało"]
[5,{"$nulls":4},"OK",null,"OK","Cena - ",60,"M",{"$nulls":9},"40 za mało"]
{"$rows_left_out":7}
{"sheet":"Dane","index":1,"n_rows":22,"n_cols":95,"rows_kept":22,"merged":[[0,7,0,9],[0,17,0,19],[0,27,0,29],[0,37,0,39],[0,47,0,49],[0,57,0,59],[0,67,0,69],[0,77,0,79],[0,87,0,89],[1,1,1,2]]}
[{"$nulls":14},{"$f":"AVERAGE(H3:H24)","v":{"v":24602.090909090908,"d":"24,602.09 zł"}},null,null,"Zadanie 2",{"$nulls":6},{"$f":"AVERAGE(R3:R24)","v":{"$error":"#DIV/0!"}},null,null,"Zadanie 3",{"$nulls":6},{"$f":"AVERAGE(AB3:AB24)","v":{"$error":"#DIV/0!"}},null,null,"Zadanie 4",{"$nulls":6},{"$f":"AVERAGE(AL3:AL24)","v":{"$error":"#DIV/0!"}},null,null,"Zadanie 5",{"$nulls":6},{"$f":"AVERAGE(AV3:AV24)","v":{"$error":"#DIV/0!"}},null,null,"Zadanie 6",{"$nulls":6},{"$f":"AVERAGE(BF3:BF24)","v":{"$error":"#DIV/0!"}},null,null,"Zadanie 7",{"$nulls":6},{"$f":"AVERAGE(BP3:BP24)","v":{"$error":"#DIV/0!"}},null,null,"Zadanie 8",{"$nulls":6},{"$f":"AVERAGE(BZ3:BZ24)","v":{"$error":"#DIV/0!"}},null,null,"Zadanie 9",{"$nulls":6},{"$f":"AVERAGE(CJ3:CJ24)","v":{"$error":"#DIV/0!"}}]
["Nr oferty","Wykonawca",null,"Nazwa","Ulica","Miasto","Netto","Brutto",{"$f":"Wnioski!$I2&\" \"&Wnioski!$J2&\"%\"","v":"Cena -  50%"},{"$f":"Wnioski!$L2&\" \"&Wnioski!$M2&\"%\"","v":"Doświadczenie trenera w realizacji szkolen/warsztetów interpersonalnych ( w godzinach) 40%"},{"$f":"Wnioski!$O2&\" \"&Wnioski!$P2&\"%\"","v":"Termin przeprowadzenia I Warsztatu  (w dniach) 10%"},{"$f":"Wnioski!$R2&\" \"&Wnioski!$S2&\"%\"","v":" %"},"Netto = brutto","Szacunek 30%","Średnia 30%",null,"Netto","Brutto",{"$f":"Wnioski!$I3&\" \"&Wnioski!$J3&\"%\"","v":"Cena -  60%"},{"$f":"Wnioski!$L3&\" \"&Wnioski!$M3&\"%\"","v":" %"},{"$f":"Wnioski!$O3&\" \"&Wnioski!$P3&\"%\"","v":" %"},{"$f":"Wnioski!$R3&\" \"&Wnioski!$S3&\"%\"","v":" %"},"Netto = brutto","Szacunek 30%","Średnia 30%",null,"Netto","Brutto",{"$f":"Wnioski!$I4&\" \"&Wnioski!$J4&\"%\"","v":"Cena -  60%"},{"$f":"Wnioski!$L4&\" \"&Wnioski!$M4&\"%\"","v":" %"},{"$f":"Wnioski!$O4&\" \"&Wnioski!$P4&\"%\"","v":" %"},{"$f":"Wnioski!$R4&\" \"&Wnioski!$S4&\"%\"","v":" %"},"Netto = brutto","Szacunek 30%","Średnia 30%",null,"Netto","Brutto",{"$f":"Wnioski!$I5&\" \"&Wnioski!$J5&\"%\"","v":"Cena -  60%"},{"$f":"Wnioski!$L5&\" \"&Wnioski!$M5&\"%\"","v":" %"},{"$f":"Wnioski!$O5&\" \"&Wnioski!$P5&\"%\"","v":" %"},{"$f":"Wnioski!$R5&\" \"&Wnioski!$S5&\"%\"","v":" %"},"Netto = brutto","Szacunek 30%","Średnia 30%",null,"Netto","Brutto",{"$f":"Wnioski!$I6&\" \"&Wnioski!$J6&\"%\"","v":"Cena -  60%"},{"$f":"Wnioski!$L6&\" \"&Wnioski!$M6&\"%\"","v":" %"},{"$f":"Wnioski!$O6&\" \"&Wnioski!$P6&\"%\"","v":" %"},{"$f":"Wnioski!$R6&\" \"&Wnioski!$S6&\"%\"","v":" %"},"Netto = brutto","Szacunek 30%","Średnia 30%",null,"Netto","Brutto",{"$f":"Wnioski!$I7&\" \"&Wnioski!$J7&\"%\"","v":"Cena -  60%"},{"$f":"Wnioski!$L7&\" \"&Wnioski!$M7&\"%\"","v":" %"},{"$f":"Wnioski!$O7&\" \"&Wnioski!$P7&\"%\"","v":" %"},{"$f":"Wnioski!$R7&\" \"&Wnioski!$S7&\"%\"","v":" %"},"Netto = brutto","Szacunek 30%","Średnia 30%",null,"Netto","Brutto",{"$f":"Wnioski!$I8&\" \"&Wnioski!$J8&\"%\"","v":"Cena -  60%"},{"$f":"Wnioski!$L8&\" \"&Wnioski!$M8&\"%\"","v":" %"},{"$f":"Wnioski!$O8&\" \"&Wnioski!$P8&\"%\"","v":" %"},{"$f":"Wnioski!$R8&\" \"&Wnioski!$S8&\"%\"","v":" %"},"Netto = brutto","Szacunek 30%","Średnia 30%",null,"Netto","Brutto",{"$f":"Wnioski!$I9&\" \"&Wnioski!$J9&\"%\"","v":"Cena -  60%"},{"$f":"Wnioski!$L9&\" \"&Wnioski!$M9&\"%\"","v":" %"},{"$f":"Wnioski!$O9&\" \"&Wnioski!$P9&\"%\"","v":" %"},{"$f":"Wnioski!$R9&\" \"&Wnioski!$S9&\"%\"","v":" %"},"Netto = brutto","Szacunek 30%","Średnia 30%",null,"Netto","Brutto",{"$f":"Wnioski!$I10&\" \"&Wnioski!$J10&\"%\"","v":"Cena -  60%"},{"$f":"Wnioski!$L10&\" \"&Wnioski!$M10&\"%\"","v":"Okres gwarancji (w miesiącach) - %"},{"$f":"Wnioski!$O10&\" \"&Wnioski!$P10&\"%\"","v":"Termin płatności (w dniach) -  %"},{"$f":"Wnioski!$R10&\" \"&Wnioski!$S10&\"%\"","v":" %"},"Netto = brutto","Szacunek 30%","Średnia 30%"]
[1,null,8,{"$f":"VLOOKUP($C3,Wykonawcy!$A$2:$D$31,2)","v":"Nowoczesny Osrodek Edukacji Anna Ratuszniak"},{"$f":"VLOOKUP($C3,Wykonawcy!$A$2:$D$31,3)","v":"ul. Zaułek Szkolny 24"},{"$f":"VLOOKUP($C3,Wykonawcy!$A$2:$D$31,4)","v":"55-002 Kamieniec Wrocławski"},null,{"v":30000,"d":"30,000.00 zł"},{"$f":"H3","v":{"v":30000,"d":"30,000.00 zł"}},4256,1,null,{"$f":"IF(H3=ROUND(G3*1.23,2), \"\", IF(G3=0,\"\",\"Błąd\"))","v":""},{"$f":"IF(H3>Wnioski!$D$2*1.23*0.7,\"\",\"Rażąca\")","v":""},{"$f":"IF(H3<O$1*0.7,\"Rażąca\",\"\")","v":""},{"$nulls":3},{"$f":"R3","v":0},{"$nulls":3},{"$f":"IF(R3=ROUND(Q3*1.23,2), \"\", IF(Q3=0,\"\",\"Błąd\"))","v":""},{"$f":"IF(R3>Wnioski!$D$3*1.23*0.7,\"\",\"Rażąca\")","v":"Rażąca"},{"$f":"IF(R3<Y$1*0.7,\"Rażąca\",\"\")","v":{"$error":"#DIV/0!"}},{"$nulls":3},{"$f":"AB3","v":0},{"$nulls":3},{"$f":"IF(AB3=ROUND(AA3*1.23,2), \"\", IF(AA3=0,\"\",\"Błąd\"))","v":""},{"$f":"IF(AB3>Wnioski!$D$4*1.23*0.7,\"\",\"Rażąca\")","v":"Rażąca"},{"$f":"IF(AB3<AI$1*0.7,\"Rażąca\",\"\")","v":{"$error":"#DIV/0!"}},{"$nulls":3},{"$f":"AL3","v":0},{"$nulls":3},{"$f":"IF(AL3=ROUND(AK3*1.23,2), \"\", IF(AK3=0,\"\",\"Błąd\"))","v":""},{"$f":"IF(AL3>Wnioski!$D$5*1.23*0.7,\"\",\"Rażąca\")","v":"Rażąca"},{"$f":"IF(AL3<AS$1*0.7,\"Rażąca\",\"\")","v":{"$error":"#DIV/0!"}},{"$nulls":3},{"$f":"AV3","v":0},{"$nulls":3},{"$f":"IF(AV3=ROUND(AU3*1.23,2), \"\", IF(AU3=0,\"\",\"Błąd\"))","v":""},{"$f":"IF(AV3>Wnioski!$D$6*1.23*0.7,\"\",\"Rażąca\")","v":"Rażąca"},{"$f":"IF(AV3<BC$1*0.7,\"Rażąca\",\"\")","v":{"$error":"#DIV/0!"}},{"$nulls":3},{"$f":"BF3","v":0},{"$nulls":3},{"$f":"IF(BF3=ROUND(BE3*1.23,2), \"\", IF(BE3=0,\"\",\"Błąd\"))","v":""},{"$f":"IF(BF3>Wnioski!$D$7*1.23*0.7,\"\",\"Rażąca\")","v":"Rażąca"},{"$f":"IF(BF3<BM$1*0.7,\"Rażąca\",\"\")","v":{"$error":"#DIV/0!"}},{"$nulls":3},{"$f":"BP3","v":0},{"$nulls":3},{"$f":"IF(BP3=ROUND(BO3*1.23,2), \"\", IF(BO3=0,\"\",\"Błąd\"))","v":""},{"$f":"IF(BP3>Wnioski!$D$8*1.23*0.7,\"\",\"Rażąca\")","v":"Rażąca"},{"$f":"IF(BP3<BW$1*0.7,\"Rażąca\",\"\")","v":{"$error":"#DIV/0!"}},{"$nulls":3},{"$f":"BZ3","v":0},{"$nulls":3},{"$f":"IF(BZ3=ROUND(BY3*1.23,2), \"\", IF(BY3=0,\"\",\"Błąd\"))","v":""},{"$f":"IF(BZ3>Wnioski!$D$9*1.23*0.7,\"\",\"Rażąca\")","v":"Rażąca"},{"$f":"IF(BZ3<CG$1*0.7,\"Rażąca\",\"\")","v":{"$error":"#DIV/0!"}},{"$nulls":3},{"$f":"CJ3","v":0},{"$nulls":3},{"$f":"IF(CJ3=ROUND(CI3*1.23,2), \"\", IF(CI3=0,\"\",\"Błąd\"))","v":""},{"$f":"IF(CJ3>Wnioski!$D$10*1.23*0.7,\"\",\"Rażąca\")","v":"Rażąca"},{"$f":"IF(CJ3<CQ$1*0.7,\"Rażąca\",\"\")","v":{"$error":"#DIV/0!"}}]
[2,null,1,{"$f":"VLOOKUP($C4,Wykonawcy!$A$2:$D$31,2)","v":"Agencja Analiz i Doradztwa Personalnego Remigiusz Koc"},{"$f":"VLOOKUP($C4,Wykonawcy!$A$2:$D$31,3)","v":"ul. Gdańska 105/4"},{"$f":"VLOOKUP($C4,Wykonawcy!$A$2:$D$31,4)","v":"85-022 Bydgoszcz"},null,{"v":16728,"d":"16,728.00 zł"},{"$f":"H4","v":{"v":16728,"d":"16,728.00 zł"}},1471,1,null,{"$f":"IF(H4=ROUND(G4*1.23,2), \"\", IF(G4=0,\"\",\"Błąd\"))","v":""},{"$f":"IF(H4>Wnioski!$D$2*1.23*0.7,\"\",\"Rażąca\")","v":"Rażąca"},{"$f":"IF(H4<O$1*0.7,\"Rażąca\",\"\")","v":"Rażąca"},{"$nulls":3},{"$f":"R4","v":0},{"$nulls":3},{"$f":"IF(R4=ROUND(Q4*1.23,2), \"\", IF(Q4=0,\"\",\"Błąd\"))","v":""},{"$f":"IF(R4>Wnioski!$D$3*1.23*0.7,\"\",\"Rażąca\")","v":"Rażąca"},{"$f":"IF(R4<Y$1*0.7,\"Rażąca\",\"\")","v":{"$error":"#DIV/0!"}},{"$nulls":3},0,{"$nulls":3},{"$f":"IF(AB4=ROUND(AA4*1.23,2), \"\", IF(AA4=0,\"\",\"Błąd\"))","v":""},{"$f":"IF(AB4>Wnioski!$D$4*1.23*0.7,\"\",\"Rażąca\")","v":"Rażąca"},{"$f":"IF(AB4<AI$1*0.7,\"Rażąca\",\"\")","v":{"$error":"#DIV/0!"}},{"$nulls":3},0,{"$nulls":3},{"$f":"IF(AL4=ROUND(AK4*1.23,2), \"\", IF(AK4=0,\"\",\"Błąd\"))","v":""},{"$f":"IF(AL4>Wnioski!$D$5*1.23*0.7,\"\",\"Rażąca\")","v":"Rażąca"},{"$f":"IF(AL4<AS$1*0.7,\"Rażąca\",\"\")","v":{"$error":"#DIV/0!"}},{"$nulls":3},0,{"$nulls":3},{"$f":"IF(AV4=ROUND(AU4*1.23,2), \"\", IF(AU4=0,\"\",\"Błąd\"))","v":""},{"$f":"IF(AV4>Wnioski!$D$6*1.23*0.7,\"\",\"Rażąca\")","v":"Rażąca"},{"$f":"IF(AV4<BC$1*0.7,\"Rażąca\",\"\")","v":{"$error":"#DIV/0!"}},{"$nulls":3},0,{"$nulls":3},{"$f":"IF(BF4=ROUND(BE4*1.23,2), \"\", IF(BE4=0,\"\",\"Błąd\"))","v":""},{"$f":"IF(BF4>Wnioski!$D$7*1.23*0.7,\"\",\"Rażąca\")","v":"Rażąca"},{"$f":"IF(BF4<BM$1*0.7,\"Rażąca\",\"\")","v":{"$error":"#DIV/0!"}},{"$nulls":3},0,{"$nulls":3},{"$f":"IF(BP4=ROUND(BO4*1.23,2), \"\", IF(BO4=0,\"\",\"Błąd\"))","v":""},{"$f":"IF(BP4>Wnioski!$D$8*1.23*0.7,\"\",\"Rażąca\")","v":"Rażąca"},{"$f":"IF(BP4<BW$1*0.7,\"Rażąca\",\"\")","v":{"$error":"#DIV/0!"}},{"$nulls":3},0,{"$nulls":3},{"$f":"IF(BZ4=ROUND(BY4*1.23,2), \"\", IF(BY4=0,\"\",\"Błąd\"))","v":""},{"$f":"IF(BZ4>Wnioski!$D$9*1.23*0.7,\"\",\"Rażąca\")","v":"Rażąca"},{"$f":"IF(BZ4<CG$1*0.7,\"Rażąca\",\"\")","v":{"$error":"#DIV/0!"}},{"$nulls":3},0,{"$nulls":3},{"$f":"IF(CJ4=ROUND(CI4*1.23,2), \"\", IF(CI4=0,\"\",\"Błąd\"))","v":""},{"$f":"IF(CJ4>Wnioski!$D$10*1.23*0.7,\"\",\"Rażąca\")","v":"Rażąca"},{"$error":"#DIV/0!"}]
[3,null,5,{"$f":"VLOOKUP($C5,Wykonawcy!$A$2:$D$31,2)","v":"IMMOQEE Sp. z o.o."},{"$f":"VLOOKUP($C5,Wykonawcy!$A$2:$D$31,3)","v":"ul. Karola Chodkiewicza 3 lok. U 10"},{"$f":"VLOOKUP($C5,Wykonawcy!$A$2:$D$31,4)","v":"02-593 Warszawa"},null,{"v":19500,"d":"19,500.00 zł"},{"$f":"H5","v":{"v":19500,"d":"19,500.00 zł"}},600,3,null,"",{"$f":"IF(H5>Wnioski!$D$2*1.23*0.7,\"\",\"Rażąca\")","v":"Rażąca"},"",{"$nulls":3},0,{"$nulls":3},"",{"$f":"IF(R5>Wnioski!$D$3*1.23*0.7,\"\",\"Rażąca\")","v":"Rażąca"},{"$error":"#DIV/0!"},{"$nulls":3},0,{"$nulls":3},"",{"$f":"IF(AB5>Wnioski!$D$4*1.23*0.7,\"\",\"Rażąca\")","v":"Rażąca"},{"$error":"#DIV/0!"},{"$nulls":3},0,{"$nulls":3},"",{"$f":"IF(AL5>Wnioski!$D$5*1.23*0.7,\"\",\"Rażąca\")","v":"Rażąca"},{"$error":"#DIV/0!"},{"$nulls":3},0,{"$nulls":3},"",{"$f":"IF(AV5>Wnioski!$D$6*1.23*0.7,\"\",\"Rażąca\")","v":"Rażąca"},{"$error":"#DIV/0!"},{"$nulls":3},0,{"$nulls":3},"",{"$f":"IF(BF5>Wnioski!$D$7*1.23*0.7,\"\",\"Rażąca\")","v":"Rażąca"},{"$error":"#DIV/0!"},{"$nulls":3},0,{"$nulls":3},"",{"$f":"IF(BP5>Wnioski!$D$8*1.23*0.7,\"\",\"Rażąca\")","v":"Rażąca"},{"$error":"#DIV/0!"},{"$nulls":3},0,{"$nulls":3},"",{"$f":"IF(BZ5>Wnioski!$D$9*1.23*0.7,\"\",\"Rażąca\")","v":"Rażąca"},{"$error":"#DIV/0!"},{"$nulls":3},0,{"$nulls":3},"",{"$f":"IF(CJ5>Wnioski!$D$10*1.23*0.7,\"\",\"Rażąca\")","v":"Rażąca"},{"$error":"#DIV/0!"}]
[4,null,2,{"$f":"VLOOKUP($C6,Wykonawcy!$A$2:$D$31,2)","v":"Brainstorm Group Sp. z o.o. "},{"$f":"VLOOKUP($C6,Wykonawcy!$A$2:$D$31,3)","v":"ul. Perła 10"},{"$f":"VLOOKUP($C6,Wykonawcy!$A$2:$D$31,4)","v":"41-300 Dabrowa Górnicza"},null,{"v":73800,"d":"73,800.00 zł"},{"v":73800,"d":"73,800.00 zł"},1916,1,null,"",{"$f":"IF(H6>Wnioski!$D$2*1.23*0.7,\"\",\"Rażąca\")","v":""},"",{"$nulls":3},0,{"$nulls":3},"",{"$f":"IF(R6>Wnioski!$D$3*1.23*0.7,\"\",\"Rażąca\")","v":"Rażąca"},{"$error":"#DIV/0!"},{"$nulls":3},0,{"$nulls":3},"",{"$f":"IF(AB6>Wnioski!$D$4*1.23*0.7,\"\",\"Rażąca\")","v":"Rażąca"},{"$error":"#DIV/0!"},{"$nulls":3},0,{"$nulls":3},"",{"$f":"IF(AL6>Wnioski!$D$5*1.23*0.7,\"\",\"Rażąca\")","v":"Rażąca"},{"$error":"#DIV/0!"},{"$nulls":3},0,{"$nulls":3},"",{"$f":"IF(AV6>Wnioski!$D$6*1.23*0.7,\"\",\"Rażąca\")","v":"Rażąca"},{"$error":"#DIV/0!"},{"$nulls":3},0,{"$nulls":3},"",{"$f":"IF(BF6>Wnioski!$D$7*1.23*0.7,\"\",\"Rażąca\")","v":"Rażąca"},{"$error":"#DIV/0!"},{"$nulls":3},0,{"$nulls":3},"",{"$f":"IF(BP6>Wnioski!$D$8*1.23*0.7,\"\",\"Rażąca\")","v":"Rażąca"},{"$error":"#DIV/0!"},{"$nulls":3},0,{"$nulls":3},"",{"$f":"IF(BZ6>Wnioski!$D$9*1.23*0.7,\"\",\"Rażąca\")","v":"Rażąca"},{"$error":"#DIV/0!"},{"$nulls":3},0,{"$nulls":3},"",{"$f":"IF(CJ6>Wnioski!$D$10*1.23*0.7,\"\",\"Rażąca\")","v":"Rażąca"},{"$error":"#DIV/0!"}]
{"$rows_left_out":17}
{"sheet":"Zestawienie","index":2,"n_rows":33,"n_cols":38,"rows_kept":33,"merged":[[5,0,5,3],[7,0,8,0],[7,1,8,1],[7,2,7,4],[7,6,7,7],[7,10,7,11],[7,14,7,15],[7,18,7,19],[7,22,7,23],[7,26,7,27],[7,30,7,31],[7,34,7,35],[7,36,7,37],[30,0,30,3],[32,0,32,3]]}
["Uniwersytet Technologiczno-Przyrodniczy "]
["im. Jana i Jędrzeja Śniadeckich "]
["al. prof. S. Kaliskiego 7"]
["85-796 Bydgoszcz "]
[]
["INFORMACJA Z PUBLICZNEGO OTWARCIA OFERT \nPrzeprowadzenie warsztatów kompetencji miękkich (warsztaty interpersonalne) dla studentów II stopnia kierunków Mechanika i budowa maszyn i Transport - AZZP.243.35.2017, w dniu 22.05.2017 r. o godz. 09:30 \nKwota jaką zamawiający zamierza przeznaczyć na sfinansowanie zamówienia: 40 000,00 zł\n"]
{"$rows_left_out":28}
{"sheet":"Punktacja","index":3,"n_rows":52,"n_cols":47,"rows_kept":52,"merged":[[2,0,3,0],[2,1,3,1],[2,2,2,3],[2,7,2,8],[2,12,2,13],[2,17,2,18],[2,22,2,23],[2,27,2,28],[2,32,2,33],[2,37,2,38],[2,42,2,43],[2,44,2,45],[30,0,31,0],[30,1,31,1],[30,2,30,6],[30,7,30,11],[30,12,30,16],[30,17,30,21],[30,22,30,26],[30,27,30,31],[30,32,30,36],[30,37,30,41],[30,42,30,46]]}
[null,"R/M",{"$f":"Wnioski!$K2","v":"M"},{"$f":"Wnioski!$N2","v":"R"},{"$f":"Wnioski!$Q2","v":"M"},{"$f":"Wnioski!$T2","v":0},null,{"$f":"Wnioski!$K3","v":"M"},{"$f":"Wnioski!$N3","v":0},{"$f":"Wnioski!$Q3","v":0},{"$f":"Wnioski!$T3","v":0},null,{"$f":"Wnioski!$K4","v":"M"},{"$f":"Wnioski!$N4","v":0},{"$f":"Wnioski!$Q4","v":0},{"$f":"Wnioski!$T4","v":0},null,{"$f":"Wnioski!$K5","v":"M"},{"$f":"Wnioski!$N5","v":0},{"$f":"Wnioski!$Q5","v":0},{"$f":"Wnioski!$T5","v":0},null,{"$f":"Wnioski!$K6","v":"M"},{"$f":"Wnioski!$N6","v":0},{"$f":"Wnioski!$Q6","v":0},{"$f":"Wnioski!$T6","v":0},null,{"$f":"Wnioski!$K7","v":"M"},{"$f":"Wnioski!$N7","v":0},{"$f":"Wnioski!$Q7","v":0},{"$f":"Wnioski!$T7","v":0},null,{"$f":"Wnioski!$K8","v":"M"},{"$f":"Wnioski!$N8","v":0},{"$f":"Wnioski!$Q8","v":0},{"$f":"Wnioski!$T8","v":0},null,{"$f":"Wnioski!$K9","v":"M"},{"$f":"Wnioski!$N9","v":0},{"$f":"Wnioski!$Q9","v":0},{"$f":"Wnioski!$T9","v":0},null,{"$f":"Wnioski!$K10","v":"M"},{"$f":"Wnioski!$N10","v":0},{"$f":"Wnioski!$Q10","v":0},{"$f":"Wnioski!$T10","v":0}]
[null,"Waga",{"$f":"Wnioski!$J2","v":50},{"$f":"Wnioski!$M2","v":40},{"$f":"Wnioski!$P2","v":10},{"$f":"Wnioski!$S2","v":0},null,{"$f":"Wnioski!$J3","v":60},{"$f":"Wnioski!$M3","v":0},{"$f":"Wnioski!$P3","v":0},{"$f":"Wnioski!$S3","v":0},null,{"$f":"Wnioski!$J4","v":60},{"$f":"Wnioski!$M4","v":0},{"$f":"Wnioski!$P4","v":0},{"$f":"Wnioski!$S4","v":0},null,{"$f":"Wnioski!$J5","v":60},{"$f":"Wnioski!$M5","v":0},{"$f":"Wnioski!$P5","v":0},{"$f":"Wnioski!$S5","v":0},null,{"$f":"Wnioski!$J6","v":60},{"$f":"Wnioski!$M6","v":0},{"$f":"Wnioski!$P6","v":0},{"$f":"Wnioski!$S6","v":0},null,{"$f":"Wnioski!$J7","v":60},{"$f":"Wnioski!$M7","v":0},{"$f":"Wnioski!$P7","v":0},{"$f":"Wnioski!$S7","v":0},null,{"$f":"Wnioski!$J8","v":60},{"$f":"Wnioski!$M8","v":0},{"$f":"Wnioski!$P8","v":0},{"$f":"Wnioski!$S8","v":0},null,{"$f":"Wnioski!$J9","v":60},{"$f":"Wnioski!$M9","v":0},{"$f":"Wnioski!$P9","v":0},{"$f":"Wnioski!$S9","v":0},null,{"$f":"Wnioski!$J10","v":60},{"$f":"Wnioski!$M10","v":0},{"$f":"Wnioski!$P10","v":0},{"$f":"Wnioski!$S10","v":0}]
[{"$f":"Zestawienie!A8","v":"Nr oferty"},"Nazwa Wykonawcy",{"$nulls":5},{"$f":"Zestawienie!G8","v":"Zadanie 2"},{"$f":"Zestawienie!H8","v":0},{"$nulls":3},{"$f":"Zestawienie!K8","v":"Zadanie 3"},{"$f":"Zestawienie!L8","v":0},{"$nulls":3},{"$f":"Zestawienie!O8","v":"Zadanie 4"},{"$f":"Zestawienie!P8","v":0},{"$nulls":3},{"$f":"Zestawienie!S8","v":"Zadanie 5"},{"$f":"Zestawienie!T8","v":0},{"$nulls":3},{"$f":"Zestawienie!W8","v":"Zadanie 6"},{"$f":"Zestawienie!X8","v":0},{"$nulls":3},{"$f":"Zestawienie!AA8","v":"Zadanie 7"},{"$f":"Zestawienie!AB8","v":0},{"$nulls":3},{"$f":"Zestawienie!AE8","v":"Zadanie 8"},{"$f":"Zestawienie!AF8","v":0},{"$nulls":3},{"$f":"Zestawienie!AI8","v":"Zadanie 9"},{"$f":"Zestawienie!AJ8","v":0}]
[{"$f":"Zestawienie!A9","v":0},0,{"$f":"Zestawienie!C9","v":"Cena -  50%"},{"$f":"Zestawienie!D9","v":"Doświadczenie trenera w realizacji szkolen/warsztetów interpersonalnych ( w godzinach) 40%"},{"$f":"Zestawienie!E9","v":"Termin przeprowadzenia I Warsztatu  (w dniach) 10%"},{"$f":"Zestawienie!F9","v":" %"},"Razem",{"$f":"Zestawienie!G9","v":"Cena -  60%"},{"$f":"Zestawienie!H9","v":" %"},{"$f":"Zestawienie!I9","v":" %"},{"$f":"Zestawienie!J9","v":" %"},"Razem",{"$f":"Zestawienie!K9","v":"Cena -  60%"},{"$f":"Zestawienie!L9","v":" %"},{"$f":"Zestawienie!M9","v":" %"},{"$f":"Zestawienie!N9","v":" %"},"Razem",{"$f":"Zestawienie!O9","v":"Cena -  60%"},{"$f":"Zestawienie!P9","v":" %"},{"$f":"Zestawienie!Q9","v":" %"},{"$f":"Zestawienie!R9","v":" %"},"Razem",{"$f":"Zestawienie!S9","v":"Cena -  60%"},{"$f":"Zestawienie!T9","v":" %"},{"$f":"Zestawienie!U9","v":" %"},{"$f":"Zestawienie!V9","v":" %"},"Razem",{"$f":"Zestawienie!W9","v":"Cena -  60%"},{"$f":"Zestawienie!X9","v":" %"},{"$f":"Zestawienie!Y9","v":" %"},{"$f":"Zestawienie!Z9","v":" %"},"Razem",{"$f":"Zestawienie!AA9","v":"Cena -  60%"},{"$f":"Zestawienie!AB9","v":" %"},{"$f":"Zestawienie!AC9","v":" %"},{"$f":"Zestawienie!AD9","v":" %"},"Razem",{"$f":"Zestawienie!AE9","v":"Cena -  60%"},{"$f":"Zestawienie!AF9","v":" %"},{"$f":"Zestawienie!AG9","v":" %"},{"$f":"Zestawienie!AH9","v":" %"},"Razem",{"$f":"Zestawienie!AI9","v":"Cena -  60%"},{"$f":"Zestawienie!AJ9","v":"Okres gwarancji (w miesiącach) - %"},{"$f":"Zestawienie!AK9","v":"Termin płatności (w dniach) -  %"},{"$f":"Zestawienie!AL9","v":" %"},"Razem"]
[{"$f":"Zestawienie!A10","v":1},{"$f":"Dane!D3","v":"Nowoczesny Osrodek Edukacji Anna Ratuszniak"},{"$f":"IF(Zestawienie!C10>0,Zestawienie!C10,\"ZERO\")","v":30000},{"$f":"IF(Zestawienie!D10>0,Zestawienie!D10,\"ZERO\")","v":4256},{"$f":"IF(Zestawienie!E10>0,Zestawienie!E10,\"ZERO\")","v":1},{"$f":"IF(Zestawienie!F10>0,Zestawienie!F10,\"ZERO\")","v":"ZERO"},null,{"$f":"IF(Zestawienie!G10>0,Zestawienie!G10,\"ZERO\")","v":"ZERO"},{"$f":"IF(Zestawienie!H10>0,Zestawienie!H10,\"ZERO\")","v":"ZERO"},{"$f":"IF(Zestawienie!I10>0,Zestawienie!I10,\"ZERO\")","v":"ZERO"},{"$f":"IF(Zestawienie!J10>0,Zestawienie!J10,\"ZERO\")","v":"ZERO"},null,{"$f":"IF(Zestawienie!K10>0,Zestawienie!K10,\"ZERO\")","v":"ZERO"},{"$f":"IF(Zestawienie!L10>0,Zestawienie!L10,\"ZERO\")","v":"ZERO"},{"$f":"IF(Zestawienie!M10>0,Zestawienie!M10,\"ZERO\")","v":"ZERO"},{"$f":"IF(Zestawienie!N10>0,Zestawienie!N10,\"ZERO\")","v":"ZERO"},null,{"$f":"IF(Zestawienie!O10>0,Zestawienie!O10,\"ZERO\")","v":"ZERO"},{"$f":"IF(Zestawienie!P10>0,Zestawienie!P10,\"ZERO\")","v":"ZERO"},{"$f":"IF(Zestawienie!Q10>0,Zestawienie!Q10,\"ZERO\")","v":"ZERO"},{"$f":"IF(Zestawienie!R10>0,Zestawienie!R10,\"ZERO\")","v":"ZERO"},null,{"$f":"IF(Zestawienie!S10>0,Zestawienie!S10,\"ZERO\")","v":"ZERO"},{"$f":"IF(Zestawienie!T10>0,Zestawienie!T10,\"ZERO\")","v":"ZERO"},{"$f":"IF(Zestawienie!U10>0,Zestawienie!U10,\"ZERO\")","v":"ZERO"},{"$f":"IF(Zestawienie!V10>0,Zestawienie!V10,\"ZERO\")","v":"ZERO"},null,{"$f":"IF(Zestawienie!W10>0,Zestawienie!W10,\"ZERO\")","v":"ZERO"},{"$f":"IF(Zestawienie!X10>0,Zestawienie!X10,\"ZERO\")","v":"ZERO"},{"$f":"IF(Zestawienie!Y10>0,Zestawienie!Y10,\"ZERO\")","v":"ZERO"},{"$f":"IF(Zestawienie!Z10>0,Zestawienie!Z10,\"ZERO\")","v":"ZERO"},null,{"$f":"IF(Zestawienie!AA10>0,Zestawienie!AA10,\"ZERO\")","v":"ZERO"},{"$f":"IF(Zestawienie!AB10>0,Zestawienie!AB10,\"ZERO\")","v":"ZERO"},{"$f":"IF(Zestawienie!AC10>0,Zestawienie!AC10,\"ZERO\")","v":"ZERO"},{"$f":"IF(Zestawienie!AD10>0,Zestawienie!AD10,\"ZERO\")","v":"ZERO"},null,{"$f":"IF(Zestawienie!AE10>0,Zestawienie!AE10,\"ZERO\")","v":"ZERO"},{"$f":"IF(Zestawienie!AF10>0,Zestawienie!AF10,\"ZERO\")","v":"ZERO"},{"$f":"IF(Zestawienie!AG10>0,Zestawienie!AG10,\"ZERO\")","v":"ZERO"},{"$f":"IF(Zestawienie!AH10>0,Zestawienie!AH10,\"ZERO\")","v":"ZERO"},null,{"$f":"IF(Zestawienie!AI10>0,Zestawienie!AI10,\"ZERO\")","v":"ZERO"},{"$f":"IF(Zestawienie!AJ10>0,Zestawienie!AJ10,\"ZERO\")","v":"ZERO"},{"$f":"IF(Zestawienie!AK10>0,Zestawienie!AK10,\"ZERO\")","v":"ZERO"},{"$f":"IF(Zestawienie!AL10>0,Zestawienie!AL10,\"ZERO\")","v":"ZERO"}]
[{"$f":"Zestawienie!A11","v":2},{"$f":"Dane!D4","v":"Agencja Analiz i Doradztwa Personalnego Remigiusz Koc"},{"$f":"IF(Zestawienie!C11>0,Zestawienie!C11,\"ZERO\")","v":16728},{"$f":"IF(Zestawienie!D11>0,Zestawienie!D11,\"ZERO\")","v":1471},{"$f":"IF(Zestawienie!E11>0,Zestawienie!E11,\"ZERO\")","v":1},{"$f":"IF(Zestawienie!F11>0,Zestawienie!F11,\"ZERO\")","v":"ZERO"},null,{"$f":"IF(Zestawienie!G11>0,Zestawienie!G11,\"ZERO\")","v":"ZERO"},{"$f":"IF(Zestawienie!H11>0,Zestawienie!H11,\"ZERO\")","v":"ZERO"},{"$f":"IF(Zestawienie!I11>0,Zestawienie!I11,\"ZERO\")","v":"ZERO"},{"$f":"IF(Zestawienie!J11>0,Zestawienie!J11,\"ZERO\")","v":"ZERO"},null,{"$f":"IF(Zestawienie!K11>0,Zestawienie!K11,\"ZERO\")","v":"ZERO"},{"$f":"IF(Zestawienie!L11>0,Zestawienie!L11,\"ZERO\")","v":"ZERO"},{"$f":"IF(Zestawienie!M11>0,Zestawienie!M11,\"ZERO\")","v":"ZERO"},{"$f":"IF(Zestawienie!N11>0,Zestawienie!N11,\"ZERO\")","v":"ZERO"},null,{"$f":"IF(Zestawienie!O11>0,Zestawienie!O11,\"ZERO\")","v":"ZERO"},{"$f":"IF(Zestawienie!P11>0,Zestawienie!P11,\"ZERO\")","v":"ZERO"},{"$f":"IF(Zestawienie!Q11>0,Zestawienie!Q11,\"ZERO\")","v":"ZERO"},{"$f":"IF(Zestawienie!R11>0,Zestawienie!R11,\"ZERO\")","v":"ZERO"},null,{"$f":"IF(Zestawienie!S11>0,Zestawienie!S11,\"ZERO\")","v":"ZERO"},{"$f":"IF(Zestawienie!T11>0,Zestawienie!T11,\"ZERO\")","v":"ZERO"},{"$f":"IF(Zestawienie!U11>0,Zestawienie!U11,\"ZERO\")","v":"ZERO"},{"$f":"IF(Zestawienie!V11>0,Zestawienie!V11,\"ZERO\")","v":"ZERO"},null,{"$f":"IF(Zestawienie!W11>0,Zestawienie!W11,\"ZERO\")","v":"ZERO"},{"$f":"IF(Zestawienie!X11>0,Zestawienie!X11,\"ZERO\")","v":"ZERO"},{"$f":"IF(Zestawienie!Y11>0,Zestawienie!Y11,\"ZERO\")","v":"ZERO"},{"$f":"IF(Zestawienie!Z11>0,Zestawienie!Z11,\"ZERO\")","v":"ZERO"},null,{"$f":"IF(Zestawienie!AA11>0,Zestawienie!AA11,\"ZERO\")","v":"ZERO"},{"$f":"IF(Zestawienie!AB11>0,Zestawienie!AB11,\"ZERO\")","v":"ZERO"},{"$f":"IF(Zestawienie!AC11>0,Zestawienie!AC11,\"ZERO\")","v":"ZERO"},{"$f":"IF(Zestawienie!AD11>0,Zestawienie!AD11,\"ZERO\")","v":"ZERO"},null,{"$f":"IF(Zestawienie!AE11>0,Zestawienie!AE11,\"ZERO\")","v":"ZERO"},{"$f":"IF(Zestawienie!AF11>0,Zestawienie!AF11,\"ZERO\")","v":"ZERO"},{"$f":"IF(Zestawienie!AG11>0,Zestawienie!AG11,\"ZERO\")","v":"ZERO"},{"$f":"IF(Zestawienie!AH11>0,Zestawienie!AH11,\"ZERO\")","v":"ZERO"},null,{"$f":"IF(Zestawienie!AI11>0,Zestawienie!AI11,\"ZERO\")","v":"ZERO"},{"$f":"IF(Zestawienie!AJ11>0,Zestawienie!AJ11,\"ZERO\")","v":"ZERO"},{"$f":"IF(Zestawienie!AK11>0,Zestawienie!AK11,\"ZERO\")","v":"ZERO"},{"$f":"IF(Zestawienie!AL11>0,Zestawienie!AL11,\"ZERO\")","v":"ZERO"}]
{"$rows_left_out":47}
{"sheet":"Wykonawcy","index":4,"n_rows":31,"n_cols":4,"rows_kept":31}
["Lp","Nazwa","Ulica","Miasto"]
[1,"Agencja Analiz i Doradztwa Personalnego Remigiusz Koc","ul. Gdańska 105/4","85-022 Bydgoszcz"]
[2,"Brainstorm Group Sp. z o.o. ","ul. Perła 10","41-300 Dabrowa Górnicza"]
[3,"Centrum Szkoleń Wielozawodowych DELTA","ul. Sandomierska 26a pokój nr 9","27-400 Ostrowiec w."]
[4,"Coach and Go Joanna Chorwacka","ul. Sosnowa 6d","86-300 Grudziądz"]
[5,"IMMOQEE Sp. z o.o.","ul. Karola Chodkiewicza 3 lok. U 10","02-593 Warszawa"]
{"$rows_left_out":25}