{"text_format":"3","workbook":"xlsx","n_sheets":5,"sheets":["Wnioski","Dane","Zestawienie","Punktacja","Wykonawcy"],"not_rendered":{"macros":1,"defined_names":1},"read":"whole","date_system":"1900"}

{"sheet":"Wnioski","index":0,"n_rows":12,"n_cols":21,"rows_kept":12}
["Nr ","Przedmiot ","Osoba","Kwota netto","Kwota Euro","Czy EUR OK","Kwota brutto","Czy brutto OK","Kryterium 1","Waga 1","R/M 1","Kryterium 2","Waga 2","R/M 2","Kryterium 3","Waga 3","R/M 3","Kryterium 4","Waga 4","R/M 4","Suma kryteriów"]
[1,"warsztaty kompetencji miekkich","E.Frelichowska",{"v":32520.33,"d":"32,520.33 zł"},{"v":7789.49,"d":"€ 7,789.49"},{"$f":"IF(ROUND(D2/4.1749,2)=E2, \"OK\",ROUND(D2/4.1749,2))","v":"OK"},{"v":40000,"d":"40,000.00 zł"},{"$f":"IF(G2>ROUND(D2*1.23,2),\"OK\",IF(G2=ROUND(D2*1.23,2),\"OK\",ROUND(D2*1.23,2)))","v":{"v":40000.01,"d":"40,000.01 zł"}},"Cena - ",50,"M","Doświadczenie trenera w realizacji szkolen/warsztetów interpersonalnych ( w godzinach)",40,"R","Termin przeprowadzenia I Warsztatu  (w dniach)",10,"M",{"$nulls":3},{"$f":"IF(J2+M2+P2+S2=100,\"OK\",IF(J2+M2+P2+S2>100,J2+M2+P2+S2-100&\" za dużo\",100-(J2+M2+P2+S2)&\" za mało\"))","v":"OK"}]
[2,{"$nulls":4},{"$f":"IF(ROUND(D3/4.1749,2)=E3, \"OK\",ROUND(D3/4.1749,2))","v":"OK"},null,{"$f":"IF(G3>ROUND(D3*1.23,2),\"OK\",IF(G3=ROUND(D3*1.23,2),\"OK\",ROUND(D3*1.23,2)))","v":"OK"},"Cena - ",60,"M",{"$nulls":9},"40 za mało"]
[3,{"$nulls":4},"OK",null,"OK","Cena - ",60,"M",{"$nulls":9},"40 za mało"]
[4,{"$nulls":4},"OK",null,"OK","Cena - ",60,"M",{"$nulls":9},"40 za mało"]
[5,{"$nulls":4},"OK",null,"OK","Cena - ",60,"M",{"$nulls":9},"40 za mało"]
[6,{"$nulls":4},"OK",null,"OK","Cena - ",60,"M",{"$nulls":9},"40 za mało"]
[7,{"$nulls":4},"OK",null,"OK","Cena - ",60,"M",{"$nulls":9},"40 za mało"]
[8,{"$nulls":4},"OK",null,"OK","Cena - ",60,"M",{"$nulls":9},"40 za mało"]
[9,{"$nulls":4},"OK",null,"OK","Cena - ",60,"M","Okres gwarancji (w miesiącach) -",null,null,"Termin płatności (w dniach) - ",{"$nulls":5},"40 za mało"]
[]
[null,null,"SUMA",{"$f":"SUM(D2:D10)","v":{"v":32520.33,"d":"32,520.33 zł"}},{"$f":"SUM(E2:E10)","v":{"v":7789.49,"d":"€ 7,789.49"}},null,{"$f":"SUM(G2:G10)","v":{"v":40000,"d":"40,000.00 zł"}}]

{"sheet":"Dane","index":1,"n_rows":22,"n_cols":95,"rows_kept":22,"merged":[[0,7,0,9],[0,17,0,19],[0,27,0,29],[0,37,0,39],[0,47,0,49],[0,57,0,59],[0,67,0,69],[0,77,0,79],[0,87,0,89],[1,1,1,2]]}
[{"$nulls":14},{"$f":"AVERAGE(H3:H24)","v":{"v":24602.090909090908,"d":"24,602.09 zł"}},null,null,"Zadanie 2",{"$nulls":6},{"$f":"AVERAGE(R3:R24)","v":{"$error":"#DIV/0!"}},null,null,"Zadanie 3",{"$nulls":6},{"$f":"AVERAGE(AB3:AB24)","v":{"$error":"#DIV/0!"}},null,null,"Zadanie 4",{"$nulls":6},{"$f":"AVERAGE(AL3:AL24)","v":{"$error":"#DIV/0!"}},null,null,"Zadanie 5",{"$nulls":6},{"$f":"AVERAGE(AV3:AV24)","v":{"$error":"#DIV/0!"}},null,null,"Zadanie 6",{"$nulls":6},{"$f":"AVERAGE(BF3:BF24)","v":{"$error":"#DIV/0!"}},null,null,"Zadanie 7",{"$nulls":6},{"$f":"AVERAGE(BP3:BP24)","v":{"$error":"#DIV/0!"}},null,null,"Zadanie 8",{"$nulls":6},{"$f":"AVERAGE(BZ3:BZ24)","v":{"$error":"#DIV/0!"}},null,null,"Zadanie 9",{"$nulls":6},{"$f":"AVERAGE(CJ3:CJ24)","v":{"$error":"#DIV/0!"}}]
["Nr oferty","Wykonawca",null,"Nazwa","Ulica","Miasto","Netto","Brutto",{"$f":"Wnioski!$I2&\" \"&Wnioski!$J2&\"%\"","v":"Cena -  50%"},{"$f":"Wnioski!$L2&\" \"&Wnioski!$M2&\"%\"","v":"Doświadczenie trenera w realizacji szkolen/warsztetów interpersonalnych ( w godzinach) 40%"},{"$f":"Wnioski!$O2&\" \"&Wnioski!$P2&\"%\"","v":"Termin przeprowadzenia I Warsztatu  (w dniach) 10%"},{"$f":"Wnioski!$R2&\" \"&Wnioski!$S2&\"%\"","v":" %"},"Netto = brutto","Szacunek 30%","Średnia 30%",null,"Netto","Brutto",{"$f":"Wnioski!$I3&\" \"&Wnioski!$J3&\"%\"","v":"Cena -  60%"},{"$f":"Wnioski!$L3&\" \"&Wnioski!$M3&\"%\"","v":" %"},{"$f":"Wnioski!$O3&\" \"&Wnioski!$P3&\"%\"","v":" %"},{"$f":"Wnioski!$R3&\" \"&Wnioski!$S3&\"%\"","v":" %"},"Netto = brutto","Szacunek 30%","Średnia 30%",null,"Netto","Brutto",{"$f":"Wnioski!$I4&\" \"&Wnioski!$J4&\"%\"","v":"Cena -  60%"},{"$f":"Wnioski!$L4&\" \"&Wnioski!$M4&\"%\"","v":" %"},{"$f":"Wnioski!$O4&\" \"&Wnioski!$P4&\"%\"","v":" %"},{"$f":"Wnioski!$R4&\" \"&Wnioski!$S4&\"%\"","v":" %"},"Netto = brutto","Szacunek 30%","Średnia 30%",null,"Netto","Brutto",{"$f":"Wnioski!$I5&\" \"&Wnioski!$J5&\"%\"","v":"Cena -  60%"},{"$f":"Wnioski!$L5&\" \"&Wnioski!$M5&\"%\"","v":" %"},{"$f":"Wnioski!$O5&\" \"&Wnioski!$P5&\"%\"","v":" %"},{"$f":"Wnioski!$R5&\" \"&Wnioski!$S5&\"%\"","v":" %"},"Netto = brutto","Szacunek 30%","Średnia 30%",null,"Netto","Brutto",{"$f":"Wnioski!$I6&\" \"&Wnioski!$J6&\"%\"","v":"Cena -  60%"},{"$f":"Wnioski!$L6&\" \"&Wnioski!$M6&\"%\"","v":" %"},{"$f":"Wnioski!$O6&\" \"&Wnioski!$P6&\"%\"","v":" %"},{"$f":"Wnioski!$R6&\" \"&Wnioski!$S6&\"%\"","v":" %"},"Netto = brutto","Szacunek 30%","Średnia 30%",null,"Netto","Brutto",{"$f":"Wnioski!$I7&\" \"&Wnioski!$J7&\"%\"","v":"Cena -  60%"},{"$f":"Wnioski!$L7&\" \"&Wnioski!$M7&\"%\"","v":" %"},{"$f":"Wnioski!$O7&\" \"&Wnioski!$P7&\"%\"","v":" %"},{"$f":"Wnioski!$R7&\" \"&Wnioski!$S7&\"%\"","v":" %"},"Netto = brutto","Szacunek 30%","Średnia 30%",null,"Netto","Brutto",{"$f":"Wnioski!$I8&\" \"&Wnioski!$J8&\"%\"","v":"Cena -  60%"},{"$f":"Wnioski!$L8&\" \"&Wnioski!$M8&\"%\"","v":" %"},{"$f":"Wnioski!$O8&\" \"&Wnioski!$P8&\"%\"","v":" %"},{"$f":"Wnioski!$R8&\" \"&Wnioski!$S8&\"%\"","v":" %"},"Netto = brutto","Szacunek 30%","Średnia 30%",null,"Netto","Brutto",{"$f":"Wnioski!$I9&\" \"&Wnioski!$J9&\"%\"","v":"Cena -  60%"},{"$f":"Wnioski!$L9&\" \"&Wnioski!$M9&\"%\"","v":" %"},{"$f":"Wnioski!$O9&\" \"&Wnioski!$P9&\"%\"","v":" %"},{"$f":"Wnioski!$R9&\" \"&Wnioski!$S9&\"%\"","v":" %"},"Netto = brutto","Szacunek 30%","Średnia 30%",null,"Netto","Brutto",{"$f":"Wnioski!$I10&\" \"&Wnioski!$J10&\"%\"","v":"Cena -  60%"},{"$f":"Wnioski!$L10&\" \"&Wnioski!$M10&\"%\"","v":"Okres gwarancji (w miesiącach) - %"},{"$f":"Wnioski!$O10&\" \"&Wnioski!$P10&\"%\"","v":"Termin płatności (w dniach) -  %"},{"$f":"Wnioski!$R10&\" \"&Wnioski!$S10&\"%\"","v":" %"},"Netto = brutto","Szacunek 30%","Średnia 30%"]
[1,null,8,{"$f":"VLOOKUP($C3,Wykonawcy!$A$2:$D$31,2)","v":"Nowoczesny Osrodek Edukacji Anna Ratuszniak"},{"$f":"VLOOKUP($C3,Wykonawcy!$A$2:$D$31,3)","v":"ul. Zaułek Szkolny 24"},{"$f":"VLOOKUP($C3,Wykonawcy!$A$2:$D$31,4)","v":"55-002 Kamieniec Wrocławski"},null,{"v":30000,"d":"30,000.00 zł"},{"$f":"H3","v":{"v":30000,"d":"30,000.00 zł"}},4256,1,null,{"$f":"IF(H3=ROUND(G3*1.23,2), \"\", IF(G3=0,\"\",\"Błąd\"))","v":""},{"$f":"IF(H3>Wnioski!$D$2*1.23*0.7,\"\",\"Rażąca\")","v":""},{"$f":"IF(H3<O$1*0.7,\"Rażąca\",\"\")","v":""},{"$nulls":3},{"$f":"R3","v":0},{"$nulls":3},{"$f":"IF(R3=ROUND(Q3*1.23,2), \"\", IF(Q3=0,\"\",\"Błąd\"))","v":""},{"$f":"IF(R3>Wnioski!$D$3*1.23*0.7,\"\",\"Rażąca\")","v":"Rażąca"},{"$f":"IF(R3<Y$1*0.7,\"Rażąca\",\"\")","v":{"$error":"#DIV/0!"}},{"$nulls":3},{"$f":"AB3","v":0},{"$nulls":3},{"$f":"IF(AB3=ROUND(AA3*1.23,2), \"\", IF(AA3=0,\"\",\"Błąd\"))","v":""},{"$f":"IF(AB3>Wnioski!$D$4*1.23*0.7,\"\",\"Rażąca\")","v":"Rażąca"},{"$f":"IF(AB3<AI$1*0.7,\"Rażąca\",\"\")","v":{"$error":"#DIV/0!"}},{"$nulls":3},{"$f":"AL3","v":0},{"$nulls":3},{"$f":"IF(AL3=ROUND(AK3*1.23,2), \"\", IF(AK3=0,\"\",\"Błąd\"))","v":""},{"$f":"IF(AL3>Wnioski!$D$5*1.23*0.7,\"\",\"Rażąca\")","v":"Rażąca"},{"$f":"IF(AL3<AS$1*0.7,\"Rażąca\",\"\")","v":{"$error":"#DIV/0!"}},{"$nulls":3},{"$f":"AV3","v":0},{"$nulls":3},{"$f":"IF(AV3=ROUND(AU3*1.23,2), \"\", IF(AU3=0,\"\",\"Błąd\"))","v":""},{"$f":"IF(AV3>Wnioski!$D$6*1.23*0.7,\"\",\"Rażąca\")","v":"Rażąca"},{"$f":"IF(AV3<BC$1*0.7,\"Rażąca\",\"\")","v":{"$error":"#DIV/0!"}},{"$nulls":3},{"$f":"BF3","v":0},{"$nulls":3},{"$f":"IF(BF3=ROUND(BE3*1.23,2), \"\", IF(BE3=0,\"\",\"Błąd\"))","v":""},{"$f":"IF(BF3>Wnioski!$D$7*1.23*0.7,\"\",\"Rażąca\")","v":"Rażąca"},{"$f":"IF(BF3<BM$1*0.7,\"Rażąca\",\"\")","v":{"$error":"#DIV/0!"}},{"$nulls":3},{"$f":"BP3","v":0},{"$nulls":3},{"$f":"IF(BP3=ROUND(BO3*1.23,2), \"\", IF(BO3=0,\"\",\"Błąd\"))","v":""},{"$f":"IF(BP3>Wnioski!$D$8*1.23*0.7,\"\",\"Rażąca\")","v":"Rażąca"},{"$f":"IF(BP3<BW$1*0.7,\"Rażąca\",\"\")","v":{"$error":"#DIV/0!"}},{"$nulls":3},{"$f":"BZ3","v":0},{"$nulls":3},{"$f":"IF(BZ3=ROUND(BY3*1.23,2), \"\", IF(BY3=0,\"\",\"Błąd\"))","v":""},{"$f":"IF(BZ3>Wnioski!$D$9*1.23*0.7,\"\",\"Rażąca\")","v":"Rażąca"},{"$f":"IF(BZ3<CG$1*0.7,\"Rażąca\",\"\")","v":{"$error":"#DIV/0!"}},{"$nulls":3},{"$f":"CJ3","v":0},{"$nulls":3},{"$f":"IF(CJ3=ROUND(CI3*1.23,2), \"\", IF(CI3=0,\"\",\"Błąd\"))","v":""},{"$f":"IF(CJ3>Wnioski!$D$10*1.23*0.7,\"\",\"Rażąca\")","v":"Rażąca"},{"$f":"IF(CJ3<CQ$1*0.7,\"Rażąca\",\"\")","v":{"$error":"#DIV/0!"}}]
[2,null,1,{"$f":"VLOOKUP($C4,Wykonawcy!$A$2:$D$31,2)","v":"Agencja Analiz i Doradztwa Personalnego Remigiusz Koc"},{"$f":"VLOOKUP($C4,Wykonawcy!$A$2:$D$31,3)","v":"ul. Gdańska 105/4"},{"$f":"VLOOKUP($C4,Wykonawcy!$A$2:$D$31,4)","v":"85-022 Bydgoszcz"},null,{"v":16728,"d":"16,728.00 zł"},{"$f":"H4","v":{"v":16728,"d":"16,728.00 zł"}},1471,1,null,{"$f":"IF(H4=ROUND(G4*1.23,2), \"\", IF(G4=0,\"\",\"Błąd\"))","v":""},{"$f":"IF(H4>Wnioski!$D$2*1.23*0.7,\"\",\"Rażąca\")","v":"Rażąca"},{"$f":"IF(H4<O$1*0.7,\"Rażąca\",\"\")","v":"Rażąca"},{"$nulls":3},{"$f":"R4","v":0},{"$nulls":3},{"$f":"IF(R4=ROUND(Q4*1.23,2), \"\", IF(Q4=0,\"\",\"Błąd\"))","v":""},{"$f":"IF(R4>Wnioski!$D$3*1.23*0.7,\"\",\"Rażąca\")","v":"Rażąca"},{"$f":"IF(R4<Y$1*0.7,\"Rażąca\",\"\")","v":{"$error":"#DIV/0!"}},{"$nulls":3},0,{"$nulls":3},{"$f":"IF(AB4=ROUND(AA4*1.23,2), \"\", IF(AA4=0,\"\",\"Błąd\"))","v":""},{"$f":"IF(AB4>Wnioski!$D$4*1.23*0.7,\"\",\"Rażąca\")","v":"Rażąca"},{"$f":"IF(AB4<AI$1*0.7,\"Rażąca\",\"\")","v":{"$error":"#DIV/0!"}},{"$nulls":3},0,{"$nulls":3},{"$f":"IF(AL4=ROUND(AK4*1.23,2), \"\", IF(AK4=0,\"\",\"Błąd\"))","v":""},{"$f":"IF(AL4>Wnioski!$D$5*1.23*0.7,\"\",\"Rażąca\")","v":"Rażąca"},{"$f":"IF(AL4<AS$1*0.7,\"Rażąca\",\"\")","v":{"$error":"#DIV/0!"}},{"$nulls":3},0,{"$nulls":3},{"$f":"IF(AV4=ROUND(AU4*1.23,2), \"\", IF(AU4=0,\"\",\"Błąd\"))","v":""},{"$f":"IF(AV4>Wnioski!$D$6*1.23*0.7,\"\",\"Rażąca\")","v":"Rażąca"},{"$f":"IF(AV4<BC$1*0.7,\"Rażąca\",\"\")","v":{"$error":"#DIV/0!"}},{"$nulls":3},0,{"$nulls":3},{"$f":"IF(BF4=ROUND(BE4*1.23,2), \"\", IF(BE4=0,\"\",\"Błąd\"))","v":""},{"$f":"IF(BF4>Wnioski!$D$7*1.23*0.7,\"\",\"Rażąca\")","v":"Rażąca"},{"$f":"IF(BF4<BM$1*0.7,\"Rażąca\",\"\")","v":{"$error":"#DIV/0!"}},{"$nulls":3},0,{"$nulls":3},{"$f":"IF(BP4=ROUND(BO4*1.23,2), \"\", IF(BO4=0,\"\",\"Błąd\"))","v":""},{"$f":"IF(BP4>Wnioski!$D$8*1.23*0.7,\"\",\"Rażąca\")","v":"Rażąca"},{"$f":"IF(BP4<BW$1*0.7,\"Rażąca\",\"\")","v":{"$error":"#DIV/0!"}},{"$nulls":3},0,{"$nulls":3},{"$f":"IF(BZ4=ROUND(BY4*1.23,2), \"\", IF(BY4=0,\"\",\"Błąd\"))","v":""},{"$f":"IF(BZ4>Wnioski!$D$9*1.23*0.7,\"\",\"Rażąca\")","v":"Rażąca"},{"$f":"IF(BZ4<CG$1*0.7,\"Rażąca\",\"\")","v":{"$error":"#DIV/0!"}},{"$nulls":3},0,{"$nulls":3},{"$f":"IF(CJ4=ROUND(CI4*1.23,2), \"\", IF(CI4=0,\"\",\"Błąd\"))","v":""},{"$f":"IF(CJ4>Wnioski!$D$10*1.23*0.7,\"\",\"Rażąca\")","v":"Rażąca"},{"$error":"#DIV/0!"}]
[3,null,5,{"$f":"VLOOKUP($C5,Wykonawcy!$A$2:$D$31,2)","v":"IMMOQEE Sp. z o.o."},{"$f":"VLOOKUP($C5,Wykonawcy!$A$2:$D$31,3)","v":"ul. Karola Chodkiewicza 3 lok. U 10"},{"$f":"VLOOKUP($C5,Wykonawcy!$A$2:$D$31,4)","v":"02-593 Warszawa"},null,{"v":19500,"d":"19,500.00 zł"},{"$f":"H5","v":{"v":19500,"d":"19,500.00 zł"}},600,3,null,"",{"$f":"IF(H5>Wnioski!$D$2*1.23*0.7,\"\",\"Rażąca\")","v":"Rażąca"},"",{"$nulls":3},0,{"$nulls":3},"",{"$f":"IF(R5>Wnioski!$D$3*1.23*0.7,\"\",\"Rażąca\")","v":"Rażąca"},{"$error":"#DIV/0!"},{"$nulls":3},0,{"$nulls":3},"",{"$f":"IF(AB5>Wnioski!$D$4*1.23*0.7,\"\",\"Rażąca\")","v":"Rażąca"},{"$error":"#DIV/0!"},{"$nulls":3},0,{"$nulls":3},"",{"$f":"IF(AL5>Wnioski!$D$5*1.23*0.7,\"\",\"Rażąca\")","v":"Rażąca"},{"$error":"#DIV/0!"},{"$nulls":3},0,{"$nulls":3},"",{"$f":"IF(AV5>Wnioski!$D$6*1.23*0.7,\"\",\"Rażąca\")","v":"Rażąca"},{"$error":"#DIV/0!"},{"$nulls":3},0,{"$nulls":3},"",{"$f":"IF(BF5>Wnioski!$D$7*1.23*0.7,\"\",\"Rażąca\")","v":"Rażąca"},{"$error":"#DIV/0!"},{"$nulls":3},0,{"$nulls":3},"",{"$f":"IF(BP5>Wnioski!$D$8*1.23*0.7,\"\",\"Rażąca\")","v":"Rażąca"},{"$error":"#DIV/0!"},{"$nulls":3},0,{"$nulls":3},"",{"$f":"IF(BZ5>Wnioski!$D$9*1.23*0.7,\"\",\"Rażąca\")","v":"Rażąca"},{"$error":"#DIV/0!"},{"$nulls":3},0,{"$nulls":3},"",{"$f":"IF(CJ5>Wnioski!$D$10*1.23*0.7,\"\",\"Rażąca\")","v":"Rażąca"},{"$error":"#DIV/0!"}]
[4,null,2,{"$f":"VLOOKUP($C6,Wykonawcy!$A$2:$D$31,2)","v":"Brainstorm Group Sp. z o.o. "},{"$f":"VLOOKUP($C6,Wykonawcy!$A$2:$D$31,3)","v":"ul. Perła 10"},{"$f":"VLOOKUP($C6,Wykonawcy!$A$2:$D$31,4)","v":"41-300 Dabrowa Górnicza"},null,{"v":73800,"d":"73,800.00 zł"},{"v":73800,"d":"73,800.00 zł"},1916,1,null,"",{"$f":"IF(H6>Wnioski!$D$2*1.23*0.7,\"\",\"Rażąca\")","v":""},"",{"$nulls":3},0,{"$nulls":3},"",{"$f":"IF(R6>Wnioski!$D$3*1.23*0.7,\"\",\"Rażąca\")","v":"Rażąca"},{"$error":"#DIV/0!"},{"$nulls":3},0,{"$nulls":3},"",{"$f":"IF(AB6>Wnioski!$D$4*1.23*0.7,\"\",\"Rażąca\")","v":"Rażąca"},{"$error":"#DIV/0!"},{"$nulls":3},0,{"$nulls":3},"",{"$f":"IF(AL6>Wnioski!$D$5*1.23*0.7,\"\",\"Rażąca\")","v":"Rażąca"},{"$error":"#DIV/0!"},{"$nulls":3},0,{"$nulls":3},"",{"$f":"IF(AV6>Wnioski!$D$6*1.23*0.7,\"\",\"Rażąca\")","v":"Rażąca"},{"$error":"#DIV/0!"},{"$nulls":3},0,{"$nulls":3},"",{"$f":"IF(BF6>Wnioski!$D$7*1.23*0.7,\"\",\"Rażąca\")","v":"Rażąca"},{"$error":"#DIV/0!"},{"$nulls":3},0,{"$nulls":3},"",{"$f":"IF(BP6>Wnioski!$D$8*1.23*0.7,\"\",\"Rażąca\")","v":"Rażąca"},{"$error":"#DIV/0!"},{"$nulls":3},0,{"$nulls":3},"",{"$f":"IF(BZ6>Wnioski!$D$9*1.23*0.7,\"\",\"Rażąca\")","v":"Rażąca"},{"$error":"#DIV/0!"},{"$nulls":3},0,{"$nulls":3},"",{"$f":"IF(CJ6>Wnioski!$D$10*1.23*0.7,\"\",\"Rażąca\")","v":"Rażąca"},{"$error":"#DIV/0!"}]
[5,null,12,{"$f":"VLOOKUP($C7,Wykonawcy!$A$2:$D$31,2)","v":"Slow Life&Business"},{"$f":"VLOOKUP($C7,Wykonawcy!$A$2:$D$31,3)","v":"ul. Szafirowa  78"},{"$f":"VLOOKUP($C7,Wykonawcy!$A$2:$D$31,4)","v":"63-460 Nowe Skalmierzyce"},null,"warsztat jednodniowy 1000,00zł netto, warsztat dwudniowy 1800,00zł","warsztat jednodniowy 1000,00zł netto, warsztat dwudniowy 1800,00zł",570,"między 10 a 16 lipca br.",null,"",{"$f":"IF(H7>Wnioski!$D$2*1.23*0.7,\"\",\"Rażąca\")","v":""},"",{"$nulls":3},0,{"$nulls":3},"",{"$f":"IF(R7>Wnioski!$D$3*1.23*0.7,\"\",\"Rażąca\")","v":"Rażąca"},{"$error":"#DIV/0!"},{"$nulls":3},{"$f":"AB7","v":0},{"$nulls":3},"",{"$f":"IF(AB7>Wnioski!$D$4*1.23*0.7,\"\",\"Rażąca\")","v":"Rażąca"},{"$error":"#DIV/0!"},{"$nulls":3},{"$f":"AL7","v":0},{"$nulls":3},"",{"$f":"IF(AL7>Wnioski!$D$5*1.23*0.7,\"\",\"Rażąca\")","v":"Rażąca"},{"$error":"#DIV/0!"},{"$nulls":3},{"$f":"AV7","v":0},{"$nulls":3},"",{"$f":"IF(AV7>Wnioski!$D$6*1.23*0.7,\"\",\"Rażąca\")","v":"Rażąca"},{"$error":"#DIV/0!"},{"$nulls":3},{"$f":"BF7","v":0},{"$nulls":3},"",{"$f":"IF(BF7>Wnioski!$D$7*1.23*0.7,\"\",\"Rażąca\")","v":"Rażąca"},{"$error":"#DIV/0!"},{"$nulls":3},{"$f":"BP7","v":0},{"$nulls":3},"",{"$f":"IF(BP7>Wnioski!$D$8*1.23*0.7,\"\",\"Rażąca\")","v":"Rażąca"},{"$error":"#DIV/0!"},{"$nulls":3},{"$f":"BZ7","v":0},{"$nulls":3},"",{"$f":"IF(BZ7>Wnioski!$D$9*1.23*0.7,\"\",\"Rażąca\")","v":"Rażąca"},{"$error":"#DIV/0!"},{"$nulls":3},0,{"$nulls":3},"",{"$f":"IF(CJ7>Wnioski!$D$10*1.23*0.7,\"\",\"Rażąca\")","v":"Rażąca"},{"$error":"#DIV/0!"}]
[6,null,10,{"$f":"VLOOKUP($C8,Wykonawcy!$A$2:$D$31,2)","v":"RAJOS COSULTING Rafał Stelmasik"},{"$f":"VLOOKUP($C8,Wykonawcy!$A$2:$D$31,3)","v":"ul. C.K.Norwida 1"},{"$f":"VLOOKUP($C8,Wykonawcy!$A$2:$D$31,4)","v":"37-550 Radymno"},null,{"v":10880,"d":"10,880.00 zł"},{"v":10880,"d":"10,880.00 zł"},300,3,null,"",{"$f":"IF(H8>Wnioski!$D$2*1.23*0.7,\"\",\"Rażąca\")","v":"Rażąca"},"Rażąca",{"$nulls":3},{"$f":"R8","v":0},{"$nulls":3},"",{"$f":"IF(R8>Wnioski!$D$3*1.23*0.7,\"\",\"Rażąca\")","v":"Rażąca"},{"$error":"#DIV/0!"},{"$nulls":3},0,{"$nulls":3},"",{"$f":"IF(AB8>Wnioski!$D$4*1.23*0.7,\"\",\"Rażąca\")","v":"Rażąca"},{"$error":"#DIV/0!"},{"$nulls":3},0,{"$nulls":3},"",{"$f":"IF(AL8>Wnioski!$D$5*1.23*0.7,\"\",\"Rażąca\")","v":"Rażąca"},{"$error":"#DIV/0!"},{"$nulls":3},0,{"$nulls":3},"",{"$f":"IF(AV8>Wnioski!$D$6*1.23*0.7,\"\",\"Rażąca\")","v":"Rażąca"},{"$error":"#DIV/0!"},{"$nulls":3},0,{"$nulls":3},"",{"$f":"IF(BF8>Wnioski!$D$7*1.23*0.7,\"\",\"Rażąca\")","v":"Rażąca"},{"$error":"#DIV/0!"},{"$nulls":3},0,{"$nulls":3},"",{"$f":"IF(BP8>Wnioski!$D$8*1.23*0.7,\"\",\"Rażąca\")","v":"Rażąca"},{"$error":"#DIV/0!"},{"$nulls":3},0,{"$nulls":3},"",{"$f":"IF(BZ8>Wnioski!$D$9*1.23*0.7,\"\",\"Rażąca\")","v":"Rażąca"},{"$error":"#DIV/0!"},{"$nulls":3},0,{"$nulls":3},"",{"$f":"IF(CJ8>Wnioski!$D$10*1.23*0.7,\"\",\"Rażąca\")","v":"Rażąca"},{"$error":"#DIV/0!"}]
[7,null,3,{"$f":"VLOOKUP($C9,Wykonawcy!$A$2:$D$31,2)","v":"Centrum Szkoleń Wielozawodowych DELTA"},{"$f":"VLOOKUP($C9,Wykonawcy!$A$2:$D$31,3)","v":"ul. Sandomierska 26a pokój nr 9"},{"$f":"VLOOKUP($C9,Wykonawcy!$A$2:$D$31,4)","v":"27-400 Ostrowiec w."},null,{"v":10055,"d":"10,055.00 zł"},{"v":10055,"d":"10,055.00 zł"},300,2,null,"",{"$f":"IF(H9>Wnioski!$D$2*1.23*0.7,\"\",\"Rażąca\")","v":"Rażąca"},"Rażąca",{"$nulls":3},0,{"$nulls":3},"",{"$f":"IF(R9>Wnioski!$D$3*1.23*0.7,\"\",\"Rażąca\")","v":"Rażąca"},{"$error":"#DIV/0!"},{"$nulls":3},0,{"$nulls":3},"",{"$f":"IF(AB9>Wnioski!$D$4*1.23*0.7,\"\",\"Rażąca\")","v":"Rażąca"},{"$error":"#DIV/0!"},{"$nulls":3},0,{"$nulls":3},"",{"$f":"IF(AL9>Wnioski!$D$5*1.23*0.7,\"\",\"Rażąca\")","v":"Rażąca"},{"$error":"#DIV/0!"},{"$nulls":3},0,{"$nulls":3},"",{"$f":"IF(AV9>Wnioski!$D$6*1.23*0.7,\"\",\"Rażąca\")","v":"Rażąca"},{"$error":"#DIV/0!"},{"$nulls":3},0,{"$nulls":3},"",{"$f":"IF(BF9>Wnioski!$D$7*1.23*0.7,\"\",\"Rażąca\")","v":"Rażąca"},{"$error":"#DIV/0!"},{"$nulls":3},0,{"$nulls":3},"",{"$f":"IF(BP9>Wnioski!$D$8*1.23*0.7,\"\",\"Rażąca\")","v":"Rażąca"},{"$error":"#DIV/0!"},{"$nulls":3},0,{"$nulls":3},"",{"$f":"IF(BZ9>Wnioski!$D$9*1.23*0.7,\"\",\"Rażąca\")","v":"Rażąca"},{"$error":"#DIV/0!"},{"$nulls":3},0,{"$nulls":3},"",{"$f":"IF(CJ9>Wnioski!$D$10*1.23*0.7,\"\",\"Rażąca\")","v":"Rażąca"},{"$error":"#DIV/0!"}]
[8,null,4,{"$f":"VLOOKUP($C10,Wykonawcy!$A$2:$D$31,2)","v":"Coach and Go Joanna Chorwacka"},{"$f":"VLOOKUP($C10,Wykonawcy!$A$2:$D$31,3)","v":"ul. Sosnowa 6d"},{"$f":"VLOOKUP($C10,Wykonawcy!$A$2:$D$31,4)","v":"86-300 Grudziądz"},null,{"v":16000,"d":"16,000.00 zł"},{"v":16000,"d":"16,000.00 zł"},500,2,null,"",{"$f":"IF(H10>Wnioski!$D$2*1.23*0.7,\"\",\"Rażąca\")","v":"Rażąca"},"Rażąca",{"$nulls":3},0,{"$nulls":3},"",{"$f":"IF(R10>Wnioski!$D$3*1.23*0.7,\"\",\"Rażąca\")","v":"Rażąca"},{"$error":"#DIV/0!"},{"$nulls":3},0,{"$nulls":3},"",{"$f":"IF(AB10>Wnioski!$D$4*1.23*0.7,\"\",\"Rażąca\")","v":"Rażąca"},{"$error":"#DIV/0!"},{"$nulls":3},0,{"$nulls":3},"",{"$f":"IF(AL10>Wnioski!$D$5*1.23*0.7,\"\",\"Rażąca\")","v":"Rażąca"},{"$error":"#DIV/0!"},{"$nulls":3},0,{"$nulls":3},"",{"$f":"IF(AV10>Wnioski!$D$6*1.23*0.7,\"\",\"Rażąca\")","v":"Rażąca"},{"$error":"#DIV/0!"},{"$nulls":3},0,{"$nulls":3},"",{"$f":"IF(BF10>Wnioski!$D$7*1.23*0.7,\"\",\"Rażąca\")","v":"Rażąca"},{"$error":"#DIV/0!"},{"$nulls":3},0,{"$nulls":3},"",{"$f":"IF(BP10>Wnioski!$D$8*1.23*0.7,\"\",\"Rażąca\")","v":"Rażąca"},{"$error":"#DIV/0!"},{"$nulls":3},0,{"$nulls":3},"",{"$f":"IF(BZ10>Wnioski!$D$9*1.23*0.7,\"\",\"Rażąca\")","v":"Rażąca"},{"$error":"#DIV/0!"},{"$nulls":3},0,{"$nulls":3},"",{"$f":"IF(CJ10>Wnioski!$D$10*1.23*0.7,\"\",\"Rażąca\")","v":"Rażąca"},{"$error":"#DIV/0!"}]
[9,null,7,{"$f":"VLOOKUP($C11,Wykonawcy!$A$2:$D$31,2)","v":"Moja Firma Elzbieta Kowalska"},{"$f":"VLOOKUP($C11,Wykonawcy!$A$2:$D$31,3)","v":"ul. Uniwersytecka 33/35 lok. 36"},{"$f":"VLOOKUP($C11,Wykonawcy!$A$2:$D$31,4)","v":"90-233 Łódź"},null,{"v":32000,"d":"32,000.00 zł"},{"v":32000,"d":"32,000.00 zł"},3038,1,null,"",{"$f":"IF(H11>Wnioski!$D$2*1.23*0.7,\"\",\"Rażąca\")","v":""},"",{"$nulls":3},0,{"$nulls":3},"",{"$f":"IF(R11>Wnioski!$D$3*1.23*0.7,\"\",\"Rażąca\")","v":"Rażąca"},{"$error":"#DIV/0!"},{"$nulls":3},0,{"$nulls":3},"",{"$f":"IF(AB11>Wnioski!$D$4*1.23*0.7,\"\",\"Rażąca\")","v":"Rażąca"},{"$error":"#DIV/0!"},{"$nulls":3},0,{"$nulls":3},"",{"$f":"IF(AL11>Wnioski!$D$5*1.23*0.7,\"\",\"Rażąca\")","v":"Rażąca"},{"$error":"#DIV/0!"},{"$nulls":3},0,{"$nulls":3},"",{"$f":"IF(AV11>Wnioski!$D$6*1.23*0.7,\"\",\"Rażąca\")","v":"Rażąca"},{"$error":"#DIV/0!"},{"$nulls":3},0,{"$nulls":3},"",{"$f":"IF(BF11>Wnioski!$D$7*1.23*0.7,\"\",\"Rażąca\")","v":"Rażąca"},{"$error":"#DIV/0!"},{"$nulls":3},0,{"$nulls":3},"",{"$f":"IF(BP11>Wnioski!$D$8*1.23*0.7,\"\",\"Rażąca\")","v":"Rażąca"},{"$error":"#DIV/0!"},{"$nulls":3},0,{"$nulls":3},"",{"$f":"IF(BZ11>Wnioski!$D$9*1.23*0.7,\"\",\"Rażąca\")","v":"Rażąca"},{"$error":"#DIV/0!"},{"$nulls":3},0,{"$nulls":3},"",{"$f":"IF(CJ11>Wnioski!$D$10*1.23*0.7,\"\",\"Rażąca\")","v":"Rażąca"},{"$error":"#DIV/0!"}]
[10,null,6,{"$f":"VLOOKUP($C12,Wykonawcy!$A$2:$D$31,2)","v":"LCE LOGOS Centrum Edukacyjne"},{"$f":"VLOOKUP($C12,Wykonawcy!$A$2:$D$31,3)","v":"ul. Ks.Kard.Wyszyńskiego 6 lok 44"},{"$f":"VLOOKUP($C12,Wykonawcy!$A$2:$D$31,4)","v":"18-400 Łomża"},null,{"v":12160,"d":"12,160.00 zł"},{"v":12160,"d":"12,160.00 zł"},922,1,null,"",{"$f":"IF(H12>Wnioski!$D$2*1.23*0.7,\"\",\"Rażąca\")","v":"Rażąca"},"Rażąca",{"$nulls":3},0,{"$nulls":3},"",{"$f":"IF(R12>Wnioski!$D$3*1.23*0.7,\"\",\"Rażąca\")","v":"Rażąca"},{"$error":"#DIV/0!"},{"$nulls":3},0,{"$nulls":3},"",{"$f":"IF(AB12>Wnioski!$D$4*1.23*0.7,\"\",\"Rażąca\")","v":"Rażąca"},{"$error":"#DIV/0!"},{"$nulls":3},0,{"$nulls":3},"",{"$f":"IF(AL12>Wnioski!$D$5*1.23*0.7,\"\",\"Rażąca\")","v":"Rażąca"},{"$error":"#DIV/0!"},{"$nulls":3},0,{"$nulls":3},"",{"$f":"IF(AV12>Wnioski!$D$6*1.23*0.7,\"\",\"Rażąca\")","v":"Rażąca"},{"$error":"#DIV/0!"},{"$nulls":3},0,{"$nulls":3},"",{"$f":"IF(BF12>Wnioski!$D$7*1.23*0.7,\"\",\"Rażąca\")","v":"Rażąca"},{"$error":"#DIV/0!"},{"$nulls":3},0,{"$nulls":3},"",{"$f":"IF(BP12>Wnioski!$D$8*1.23*0.7,\"\",\"Rażąca\")","v":"Rażąca"},{"$error":"#DIV/0!"},{"$nulls":3},0,{"$nulls":3},"",{"$f":"IF(BZ12>Wnioski!$D$9*1.23*0.7,\"\",\"Rażąca\")","v":"Rażąca"},{"$error":"#DIV/0!"},{"$nulls":3},0,{"$nulls":3},"",{"$f":"IF(CJ12>Wnioski!$D$10*1.23*0.7,\"\",\"Rażąca\")","v":"Rażąca"},{"$error":"#DIV/0!"}]
[11,null,11,{"$f":"VLOOKUP($C13,Wykonawcy!$A$2:$D$31,2)","v":"SEKA S.A. "},{"$f":"VLOOKUP($C13,Wykonawcy!$A$2:$D$31,3)","v":"ul. Bernardyńska 13"},{"$f":"VLOOKUP($C13,Wykonawcy!$A$2:$D$31,4)","v":"85-029 Bydgoszcz"},null,{"v":17500,"d":"17,500.00 zł"},{"v":17500,"d":"17,500.00 zł"},3054,1,null,"",{"$f":"IF(H13>Wnioski!$D$2*1.23*0.7,\"\",\"Rażąca\")","v":"Rażąca"},"",{"$nulls":3},0,{"$nulls":3},"",{"$f":"IF(R13>Wnioski!$D$3*1.23*0.7,\"\",\"Rażąca\")","v":"Rażąca"},{"$error":"#DIV/0!"},{"$nulls":3},0,{"$nulls":3},"",{"$f":"IF(AB13>Wnioski!$D$4*1.23*0.7,\"\",\"Rażąca\")","v":"Rażąca"},{"$error":"#DIV/0!"},{"$nulls":3},0,{"$nulls":3},"",{"$f":"IF(AL13>Wnioski!$D$5*1.23*0.7,\"\",\"Rażąca\")","v":"Rażąca"},{"$error":"#DIV/0!"},{"$nulls":3},0,{"$nulls":3},"",{"$f":"IF(AV13>Wnioski!$D$6*1.23*0.7,\"\",\"Rażąca\")","v":"Rażąca"},{"$error":"#DIV/0!"},{"$nulls":3},0,{"$nulls":3},"",{"$f":"IF(BF13>Wnioski!$D$7*1.23*0.7,\"\",\"Rażąca\")","v":"Rażąca"},{"$error":"#DIV/0!"},{"$nulls":3},0,{"$nulls":3},"",{"$f":"IF(BP13>Wnioski!$D$8*1.23*0.7,\"\",\"Rażąca\")","v":"Rażąca"},{"$error":"#DIV/0!"},{"$nulls":3},0,{"$nulls":3},"",{"$f":"IF(BZ13>Wnioski!$D$9*1.23*0.7,\"\",\"Rażąca\")","v":"Rażąca"},{"$error":"#DIV/0!"},{"$nulls":3},0,{"$nulls":3},"",{"$f":"IF(CJ13>Wnioski!$D$10*1.23*0.7,\"\",\"Rażąca\")","v":"Rażąca"},{"$error":"#DIV/0!"}]
[12,null,9,{"$f":"VLOOKUP($C14,Wykonawcy!$A$2:$D$31,2)","v":"Polska Akademia Oświaty Sp. z o.o."},{"$f":"VLOOKUP($C14,Wykonawcy!$A$2:$D$31,3)","v":"ul. Krańcowa 17/1"},{"$f":"VLOOKUP($C14,Wykonawcy!$A$2:$D$31,4)","v":"02-493 Warszawa"},null,{"v":32000,"d":"32,000.00 zł"},{"v":32000,"d":"32,000.00 zł"},6058,1,null,"",{"$f":"IF(H14>Wnioski!$D$2*1.23*0.7,\"\",\"Rażąca\")","v":""},"",{"$nulls":3},0,{"$nulls":3},"",{"$f":"IF(R14>Wnioski!$D$3*1.23*0.7,\"\",\"Rażąca\")","v":"Rażąca"},{"$error":"#DIV/0!"},{"$nulls":3},0,{"$nulls":3},"",{"$f":"IF(AB14>Wnioski!$D$4*1.23*0.7,\"\",\"Rażąca\")","v":"Rażąca"},{"$error":"#DIV/0!"},{"$nulls":3},0,{"$nulls":3},"",{"$f":"IF(AL14>Wnioski!$D$5*1.23*0.7,\"\",\"Rażąca\")","v":"Rażąca"},{"$error":"#DIV/0!"},{"$nulls":3},0,{"$nulls":3},"",{"$f":"IF(AV14>Wnioski!$D$6*1.23*0.7,\"\",\"Rażąca\")","v":"Rażąca"},{"$error":"#DIV/0!"},{"$nulls":3},0,{"$nulls":3},"",{"$f":"IF(BF14>Wnioski!$D$7*1.23*0.7,\"\",\"Rażąca\")","v":"Rażąca"},{"$error":"#DIV/0!"},{"$nulls":3},0,{"$nulls":3},"",{"$f":"IF(BP14>Wnioski!$D$8*1.23*0.7,\"\",\"Rażąca\")","v":"Rażąca"},{"$error":"#DIV/0!"},{"$nulls":3},0,{"$nulls":3},"",{"$f":"IF(BZ14>Wnioski!$D$9*1.23*0.7,\"\",\"Rażąca\")","v":"Rażąca"},{"$error":"#DIV/0!"},{"$nulls":3},0,{"$nulls":3},"",{"$f":"IF(CJ14>Wnioski!$D$10*1.23*0.7,\"\",\"Rażąca\")","v":"Rażąca"},{"$error":"#DIV/0!"}]
[13,null,25,{"$f":"VLOOKUP($C15,Wykonawcy!$A$2:$D$31,2)","v":0},{"$f":"VLOOKUP($C15,Wykonawcy!$A$2:$D$31,3)","v":0},{"$f":"VLOOKUP($C15,Wykonawcy!$A$2:$D$31,4)","v":0},null,null,0,{"$nulls":3},"",{"$f":"IF(H15>Wnioski!$D$2*1.23*0.7,\"\",\"Rażąca\")","v":"Rażąca"},"Rażąca",{"$nulls":3},0,{"$nulls":3},"",{"$f":"IF(R15>Wnioski!$D$3*1.23*0.7,\"\",\"Rażąca\")","v":"Rażąca"},{"$error":"#DIV/0!"},{"$nulls":3},0,{"$nulls":3},"",{"$f":"IF(AB15>Wnioski!$D$4*1.23*0.7,\"\",\"Rażąca\")","v":"Rażąca"},{"$error":"#DIV/0!"},{"$nulls":3},0,{"$nulls":3},"",{"$f":"IF(AL15>Wnioski!$D$5*1.23*0.7,\"\",\"Rażąca\")","v":"Rażąca"},{"$error":"#DIV/0!"},{"$nulls":3},0,{"$nulls":3},"",{"$f":"IF(AV15>Wnioski!$D$6*1.23*0.7,\"\",\"Rażąca\")","v":"Rażąca"},{"$error":"#DIV/0!"},{"$nulls":3},0,{"$nulls":3},"",{"$f":"IF(BF15>Wnioski!$D$7*1.23*0.7,\"\",\"Rażąca\")","v":"Rażąca"},{"$error":"#DIV/0!"},{"$nulls":3},0,{"$nulls":3},"",{"$f":"IF(BP15>Wnioski!$D$8*1.23*0.7,\"\",\"Rażąca\")","v":"Rażąca"},{"$error":"#DIV/0!"},{"$nulls":3},0,{"$nulls":3},"",{"$f":"IF(BZ15>Wnioski!$D$9*1.23*0.7,\"\",\"Rażąca\")","v":"Rażąca"},{"$error":"#DIV/0!"},{"$nulls":3},0,{"$nulls":3},"",{"$f":"IF(CJ15>Wnioski!$D$10*1.23*0.7,\"\",\"Rażąca\")","v":"Rażąca"},{"$error":"#DIV/0!"}]
[14,null,25,{"$f":"VLOOKUP($C16,Wykonawcy!$A$2:$D$31,2)","v":0},{"$f":"VLOOKUP($C16,Wykonawcy!$A$2:$D$31,3)","v":0},{"$f":"VLOOKUP($C16,Wykonawcy!$A$2:$D$31,4)","v":0},null,null,0,{"$nulls":3},"",{"$f":"IF(H16>Wnioski!$D$2*1.23*0.7,\"\",\"Rażąca\")","v":"Rażąca"},"Rażąca",{"$nulls":3},0,{"$nulls":3},"",{"$f":"IF(R16>Wnioski!$D$3*1.23*0.7,\"\",\"Rażąca\")","v":"Rażąca"},{"$error":"#DIV/0!"},{"$nulls":3},0,{"$nulls":3},"",{"$f":"IF(AB16>Wnioski!$D$4*1.23*0.7,\"\",\"Rażąca\")","v":"Rażąca"},{"$error":"#DIV/0!"},{"$nulls":3},0,{"$nulls":3},"",{"$f":"IF(AL16>Wnioski!$D$5*1.23*0.7,\"\",\"Rażąca\")","v":"Rażąca"},{"$error":"#DIV/0!"},{"$nulls":3},0,{"$nulls":3},"",{"$f":"IF(AV16>Wnioski!$D$6*1.23*0.7,\"\",\"Rażąca\")","v":"Rażąca"},{"$error":"#DIV/0!"},{"$nulls":3},0,{"$nulls":3},"",{"$f":"IF(BF16>Wnioski!$D$7*1.23*0.7,\"\",\"Rażąca\")","v":"Rażąca"},{"$error":"#DIV/0!"},{"$nulls":3},0,{"$nulls":3},"",{"$f":"IF(BP16>Wnioski!$D$8*1.23*0.7,\"\",\"Rażąca\")","v":"Rażąca"},{"$error":"#DIV/0!"},{"$nulls":3},0,{"$nulls":3},"",{"$f":"IF(BZ16>Wnioski!$D$9*1.23*0.7,\"\",\"Rażąca\")","v":"Rażąca"},{"$error":"#DIV/0!"},{"$nulls":3},0,{"$nulls":3},"",{"$f":"IF(CJ16>Wnioski!$D$10*1.23*0.7,\"\",\"Rażąca\")","v":"Rażąca"},{"$error":"#DIV/0!"}]
[15,null,25,{"$f":"VLOOKUP($C17,Wykonawcy!$A$2:$D$31,2)","v":0},{"$f":"VLOOKUP($C17,Wykonawcy!$A$2:$D$31,3)","v":0},{"$f":"VLOOKUP($C17,Wykonawcy!$A$2:$D$31,4)","v":0},null,null,0,{"$nulls":3},"",{"$f":"IF(H17>Wnioski!$D$2*1.23*0.7,\"\",\"Rażąca\")","v":"Rażąca"},"Rażąca",{"$nulls":3},0,{"$nulls":3},"",{"$f":"IF(R17>Wnioski!$D$3*1.23*0.7,\"\",\"Rażąca\")","v":"Rażąca"},{"$error":"#DIV/0!"},{"$nulls":3},0,{"$nulls":3},"",{"$f":"IF(AB17>Wnioski!$D$4*1.23*0.7,\"\",\"Rażąca\")","v":"Rażąca"},{"$error":"#DIV/0!"},{"$nulls":3},0,{"$nulls":3},"",{"$f":"IF(AL17>Wnioski!$D$5*1.23*0.7,\"\",\"Rażąca\")","v":"Rażąca"},{"$error":"#DIV/0!"},{"$nulls":3},0,{"$nulls":3},"",{"$f":"IF(AV17>Wnioski!$D$6*1.23*0.7,\"\",\"Rażąca\")","v":"Rażąca"},{"$error":"#DIV/0!"},{"$nulls":3},0,{"$nulls":3},"",{"$f":"IF(BF17>Wnioski!$D$7*1.23*0.7,\"\",\"Rażąca\")","v":"Rażąca"},{"$error":"#DIV/0!"},{"$nulls":3},0,{"$nulls":3},"",{"$f":"IF(BP17>Wnioski!$D$8*1.23*0.7,\"\",\"Rażąca\")","v":"Rażąca"},{"$error":"#DIV/0!"},{"$nulls":3},0,{"$nulls":3},"",{"$f":"IF(BZ17>Wnioski!$D$9*1.23*0.7,\"\",\"Rażąca\")","v":"Rażąca"},{"$error":"#DIV/0!"},{"$nulls":3},0,{"$nulls":3},"",{"$f":"IF(CJ17>Wnioski!$D$10*1.23*0.7,\"\",\"Rażąca\")","v":"Rażąca"},{"$error":"#DIV/0!"}]
[16,null,25,{"$f":"VLOOKUP($C18,Wykonawcy!$A$2:$D$31,2)","v":0},{"$f":"VLOOKUP($C18,Wykonawcy!$A$2:$D$31,3)","v":0},{"$f":"VLOOKUP($C18,Wykonawcy!$A$2:$D$31,4)","v":0},null,null,0,{"$nulls":3},"",{"$f":"IF(H18>Wnioski!$D$2*1.23*0.7,\"\",\"Rażąca\")","v":"Rażąca"},"Rażąca",{"$nulls":3},0,{"$nulls":3},"",{"$f":"IF(R18>Wnioski!$D$3*1.23*0.7,\"\",\"Rażąca\")","v":"Rażąca"},{"$error":"#DIV/0!"},{"$nulls":3},0,{"$nulls":3},"",{"$f":"IF(AB18>Wnioski!$D$4*1.23*0.7,\"\",\"Rażąca\")","v":"Rażąca"},{"$error":"#DIV/0!"},{"$nulls":3},0,{"$nulls":3},"",{"$f":"IF(AL18>Wnioski!$D$5*1.23*0.7,\"\",\"Rażąca\")","v":"Rażąca"},{"$error":"#DIV/0!"},{"$nulls":3},0,{"$nulls":3},"",{"$f":"IF(AV18>Wnioski!$D$6*1.23*0.7,\"\",\"Rażąca\")","v":"Rażąca"},{"$error":"#DIV/0!"},{"$nulls":3},0,{"$nulls":3},"",{"$f":"IF(BF18>Wnioski!$D$7*1.23*0.7,\"\",\"Rażąca\")","v":"Rażąca"},{"$error":"#DIV/0!"},{"$nulls":3},0,{"$nulls":3},"",{"$f":"IF(BP18>Wnioski!$D$8*1.23*0.7,\"\",\"Rażąca\")","v":"Rażąca"},{"$error":"#DIV/0!"},{"$nulls":3},0,{"$nulls":3},"",{"$f":"IF(BZ18>Wnioski!$D$9*1.23*0.7,\"\",\"Rażąca\")","v":"Rażąca"},{"$error":"#DIV/0!"},{"$nulls":3},0,{"$nulls":3},"",{"$f":"IF(CJ18>Wnioski!$D$10*1.23*0.7,\"\",\"Rażąca\")","v":"Rażąca"},{"$error":"#DIV/0!"}]
[17,null,25,{"$f":"VLOOKUP($C19,Wykonawcy!$A$2:$D$31,2)","v":0},{"$f":"VLOOKUP($C19,Wykonawcy!$A$2:$D$31,3)","v":0},{"$f":"VLOOKUP($C19,Wykonawcy!$A$2:$D$31,4)","v":0},null,null,0,{"$nulls":3},"",{"$f":"IF(H19>Wnioski!$D$2*1.23*0.7,\"\",\"Rażąca\")","v":"Rażąca"},"Rażąca",{"$nulls":3},0,{"$nulls":3},"",{"$f":"IF(R19>Wnioski!$D$3*1.23*0.7,\"\",\"Rażąca\")","v":"Rażąca"},{"$error":"#DIV/0!"},{"$nulls":3},0,{"$nulls":3},"",{"$f":"IF(AB19>Wnioski!$D$4*1.23*0.7,\"\",\"Rażąca\")","v":"Rażąca"},{"$error":"#DIV/0!"},{"$nulls":3},0,{"$nulls":3},"",{"$f":"IF(AL19>Wnioski!$D$5*1.23*0.7,\"\",\"Rażąca\")","v":"Rażąca"},{"$error":"#DIV/0!"},{"$nulls":3},0,{"$nulls":3},"",{"$f":"IF(AV19>Wnioski!$D$6*1.23*0.7,\"\",\"Rażąca\")","v":"Rażąca"},{"$error":"#DIV/0!"},{"$nulls":3},0,{"$nulls":3},"",{"$f":"IF(BF19>Wnioski!$D$7*1.23*0.7,\"\",\"Rażąca\")","v":"Rażąca"},{"$error":"#DIV/0!"},{"$nulls":3},0,{"$nulls":3},"",{"$f":"IF(BP19>Wnioski!$D$8*1.23*0.7,\"\",\"Rażąca\")","v":"Rażąca"},{"$error":"#DIV/0!"},{"$nulls":3},0,{"$nulls":3},"",{"$f":"IF(BZ19>Wnioski!$D$9*1.23*0.7,\"\",\"Rażąca\")","v":"Rażąca"},{"$error":"#DIV/0!"},{"$nulls":3},0,{"$nulls":3},"",{"$f":"IF(CJ19>Wnioski!$D$10*1.23*0.7,\"\",\"Rażąca\")","v":"Rażąca"},{"$error":"#DIV/0!"}]
[18,null,25,{"$f":"VLOOKUP($C20,Wykonawcy!$A$2:$D$31,2)","v":0},{"$f":"VLOOKUP($C20,Wykonawcy!$A$2:$D$31,3)","v":0},{"$f":"VLOOKUP($C20,Wykonawcy!$A$2:$D$31,4)","v":0},null,null,0,{"$nulls":3},"",{"$f":"IF(H20>Wnioski!$D$2*1.23*0.7,\"\",\"Rażąca\")","v":"Rażąca"},"Rażąca",{"$nulls":3},0,{"$nulls":3},"",{"$f":"IF(R20>Wnioski!$D$3*1.23*0.7,\"\",\"Rażąca\")","v":"Rażąca"},{"$error":"#DIV/0!"},{"$nulls":3},0,{"$nulls":3},"",{"$f":"IF(AB20>Wnioski!$D$4*1.23*0.7,\"\",\"Rażąca\")","v":"Rażąca"},{"$error":"#DIV/0!"},{"$nulls":3},0,{"$nulls":3},"",{"$f":"IF(AL20>Wnioski!$D$5*1.23*0.7,\"\",\"Rażąca\")","v":"Rażąca"},{"$error":"#DIV/0!"},{"$nulls":3},0,{"$nulls":3},"",{"$f":"IF(AV20>Wnioski!$D$6*1.23*0.7,\"\",\"Rażąca\")","v":"Rażąca"},{"$error":"#DIV/0!"},{"$nulls":3},0,{"$nulls":3},"",{"$f":"IF(BF20>Wnioski!$D$7*1.23*0.7,\"\",\"Rażąca\")","v":"Rażąca"},{"$error":"#DIV/0!"},{"$nulls":3},0,{"$nulls":3},"",{"$f":"IF(BP20>Wnioski!$D$8*1.23*0.7,\"\",\"Rażąca\")","v":"Rażąca"},{"$error":"#DIV/0!"},{"$nulls":3},0,{"$nulls":3},"",{"$f":"IF(BZ20>Wnioski!$D$9*1.23*0.7,\"\",\"Rażąca\")","v":"Rażąca"},{"$error":"#DIV/0!"},{"$nulls":3},0,{"$nulls":3},"",{"$f":"IF(CJ20>Wnioski!$D$10*1.23*0.7,\"\",\"Rażąca\")","v":"Rażąca"},{"$error":"#DIV/0!"}]
[19,null,25,{"$f":"VLOOKUP($C21,Wykonawcy!$A$2:$D$31,2)","v":0},{"$f":"VLOOKUP($C21,Wykonawcy!$A$2:$D$31,3)","v":0},{"$f":"VLOOKUP($C21,Wykonawcy!$A$2:$D$31,4)","v":0},null,null,0,{"$nulls":3},"",{"$f":"IF(H21>Wnioski!$D$2*1.23*0.7,\"\",\"Rażąca\")","v":"Rażąca"},"Rażąca",{"$nulls":3},0,{"$nulls":3},"",{"$f":"IF(R21>Wnioski!$D$3*1.23*0.7,\"\",\"Rażąca\")","v":"Rażąca"},{"$error":"#DIV/0!"},{"$nulls":3},0,{"$nulls":3},"",{"$f":"IF(AB21>Wnioski!$D$4*1.23*0.7,\"\",\"Rażąca\")","v":"Rażąca"},{"$error":"#DIV/0!"},{"$nulls":3},0,{"$nulls":3},"",{"$f":"IF(AL21>Wnioski!$D$5*1.23*0.7,\"\",\"Rażąca\")","v":"Rażąca"},{"$error":"#DIV/0!"},{"$nulls":3},0,{"$nulls":3},"",{"$f":"IF(AV21>Wnioski!$D$6*1.23*0.7,\"\",\"Rażąca\")","v":"Rażąca"},{"$error":"#DIV/0!"},{"$nulls":3},0,{"$nulls":3},"",{"$f":"IF(BF21>Wnioski!$D$7*1.23*0.7,\"\",\"Rażąca\")","v":"Rażąca"},{"$error":"#DIV/0!"},{"$nulls":3},0,{"$nulls":3},"",{"$f":"IF(BP21>Wnioski!$D$8*1.23*0.7,\"\",\"Rażąca\")","v":"Rażąca"},{"$error":"#DIV/0!"},{"$nulls":3},0,{"$nulls":3},"",{"$f":"IF(BZ21>Wnioski!$D$9*1.23*0.7,\"\",\"Rażąca\")","v":"Rażąca"},{"$error":"#DIV/0!"},{"$nulls":3},0,{"$nulls":3},"",{"$f":"IF(CJ21>Wnioski!$D$10*1.23*0.7,\"\",\"Rażąca\")","v":"Rażąca"},{"$error":"#DIV/0!"}]
[20,null,25,{"$f":"VLOOKUP($C22,Wykonawcy!$A$2:$D$31,2)","v":0},{"$f":"VLOOKUP($C22,Wykonawcy!$A$2:$D$31,3)","v":0},{"$f":"VLOOKUP($C22,Wykonawcy!$A$2:$D$31,4)","v":0},null,null,0,{"$nulls":3},"",{"$f":"IF(H22>Wnioski!$D$2*1.23*0.7,\"\",\"Rażąca\")","v":"Rażąca"},"Rażąca",{"$nulls":3},0,{"$nulls":3},"",{"$f":"IF(R22>Wnioski!$D$3*1.23*0.7,\"\",\"Rażąca\")","v":"Rażąca"},{"$error":"#DIV/0!"},{"$nulls":3},0,{"$nulls":3},"",{"$f":"IF(AB22>Wnioski!$D$4*1.23*0.7,\"\",\"Rażąca\")","v":"Rażąca"},{"$error":"#DIV/0!"},{"$nulls":3},0,{"$nulls":3},"",{"$f":"IF(AL22>Wnioski!$D$5*1.23*0.7,\"\",\"Rażąca\")","v":"Rażąca"},{"$error":"#DIV/0!"},{"$nulls":3},0,{"$nulls":3},"",{"$f":"IF(AV22>Wnioski!$D$6*1.23*0.7,\"\",\"Rażąca\")","v":"Rażąca"},{"$error":"#DIV/0!"},{"$nulls":3},0,{"$nulls":3},"",{"$f":"IF(BF22>Wnioski!$D$7*1.23*0.7,\"\",\"Rażąca\")","v":"Rażąca"},{"$error":"#DIV/0!"},{"$nulls":3},0,{"$nulls":3},"",{"$f":"IF(BP22>Wnioski!$D$8*1.23*0.7,\"\",\"Rażąca\")","v":"Rażąca"},{"$error":"#DIV/0!"},{"$nulls":3},0,{"$nulls":3},"",{"$f":"IF(BZ22>Wnioski!$D$9*1.23*0.7,\"\",\"Rażąca\")","v":"Rażąca"},{"$error":"#DIV/0!"},{"$nulls":3},0,{"$nulls":3},"",{"$f":"IF(CJ22>Wnioski!$D$10*1.23*0.7,\"\",\"Rażąca\")","v":"Rażąca"},{"$error":"#DIV/0!"}]

{"sheet":"Zestawienie","index":2,"n_rows":33,"n_cols":38,"rows_kept":33,"merged":[[5,0,5,3],[7,0,8,0],[7,1,8,1],[7,2,7,4],[7,6,7,7],[7,10,7,11],[7,14,7,15],[7,18,7,19],[7,22,7,23],[7,26,7,27],[7,30,7,31],[7,34,7,35],[7,36,7,37],[30,0,30,3],[32,0,32,3]]}
["Uniwersytet Technologiczno-Przyrodniczy "]
["im. Jana i Jędrzeja Śniadeckich "]
["al. prof. S. Kaliskiego 7"]
["85-796 Bydgoszcz "]
[]
["INFORMACJA Z PUBLICZNEGO OTWARCIA OFERT \nPrzeprowadzenie warsztatów kompetencji miękkich (warsztaty interpersonalne) dla studentów II stopnia kierunków Mechanika i budowa maszyn i Transport - AZZP.243.35.2017, w dniu 22.05.2017 r. o godz. 09:30 \nKwota jaką zamawiający zamierza przeznaczyć na sfinansowanie zamówienia: 40 000,00 zł\n"]
[]
["Nr oferty","Nazwa oraz adres wykonawcy","KRYTERIA OCENY OFERT",{"$nulls":3},"Zadanie 2",{"$nulls":3},"Zadanie 3",{"$nulls":3},"Zadanie 4",{"$nulls":3},"Zadanie 5",{"$nulls":3},"Zadanie 6",{"$nulls":3},"Zadanie 7",{"$nulls":3},"Zadanie 8",{"$nulls":3},"Zadanie 9"]
[null,null,{"$f":"Dane!I2","v":"Cena -  50%"},{"$f":"Dane!J2","v":"Doświadczenie trenera w realizacji szkolen/warsztetów interpersonalnych ( w godzinach) 40%"},{"$f":"Dane!K2","v":"Termin przeprowadzenia I Warsztatu  (w dniach) 10%"},{"$f":"Dane!L2","v":" %"},{"$f":"Dane!S2","v":"Cena -  60%"},{"$f":"Dane!T2","v":" %"},{"$f":"Dane!U2","v":" %"},{"$f":"Dane!V2","v":" %"},{"$f":"Dane!AC2","v":"Cena -  60%"},{"$f":"Dane!AD2","v":" %"},{"$f":"Dane!AE2","v":" %"},{"$f":"Dane!AF2","v":" %"},{"$f":"Dane!AM2","v":"Cena -  60%"},{"$f":"Dane!AN2","v":" %"},{"$f":"Dane!AO2","v":" %"},{"$f":"Dane!AP2","v":" %"},{"$f":"Dane!AW2","v":"Cena -  60%"},{"$f":"Dane!AX2","v":" %"},{"$f":"Dane!AY2","v":" %"},{"$f":"Dane!AZ2","v":" %"},{"$f":"Dane!BG2","v":"Cena -  60%"},{"$f":"Dane!BH2","v":" %"},{"$f":"Dane!BI2","v":" %"},{"$f":"Dane!BJ2","v":" %"},{"$f":"Dane!BQ2","v":"Cena -  60%"},{"$f":"Dane!BR2","v":" %"},{"$f":"Dane!BS2","v":" %"},{"$f":"Dane!BT2","v":" %"},{"$f":"Dane!CA2","v":"Cena -  60%"},{"$f":"Dane!CB2","v":" %"},{"$f":"Dane!CC2","v":" %"},{"$f":"Dane!CD2","v":" %"},{"$f":"Dane!CK2","v":"Cena -  60%"},{"$f":"Dane!CL2","v":"Okres gwarancji (w miesiącach) - %"},{"$f":"Dane!CM2","v":"Termin płatności (w dniach) -  %"},{"$f":"Dane!CN2","v":" %"}]
[1,{"$f":"Dane!D3&\"\n\"&Dane!E3&\"\n\"&Dane!F3","v":"Nowoczesny Osrodek Edukacji Anna Ratuszniak\nul. Zaułek Szkolny 24\n55-002 Kamieniec Wrocławski"},{"$f":"Dane!I3","v":{"v":30000,"d":"30,000.00 zł"}},{"$f":"Dane!J3","v":4256},{"$f":"Dane!K3","v":1},{"$f":"Dane!L3","v":0},{"$f":"Dane!S3","v":0},{"$f":"Dane!T3","v":0},{"$f":"Dane!U3","v":0},{"$f":"Dane!V3","v":0},{"$f":"Dane!AC3","v":0},{"$f":"Dane!AD3","v":0},{"$f":"Dane!AE3","v":0},{"$f":"Dane!AF3","v":0},{"$f":"Dane!AM3","v":0},{"$f":"Dane!AN3","v":0},{"$f":"Dane!AO3","v":0},{"$f":"Dane!AP3","v":0},{"$f":"Dane!AW3","v":0},{"$f":"Dane!AX3","v":0},{"$f":"Dane!AY3","v":0},{"$f":"Dane!AZ3","v":0},{"$f":"Dane!BG3","v":0},{"$f":"Dane!BH3","v":0},{"$f":"Dane!BI3","v":0},{"$f":"Dane!BJ3","v":0},{"$f":"Dane!BQ3","v":0},{"$f":"Dane!BR3","v":0},{"$f":"Dane!BS3","v":0},{"$f":"Dane!BT3","v":0},{"$f":"Dane!CA3","v":0},{"$f":"Dane!CB3","v":0},{"$f":"Dane!CC3","v":0},{"$f":"Dane!CD3","v":0},{"$f":"Dane!CK3","v":0},{"$f":"Dane!CL3","v":0},{"$f":"Dane!CM3","v":0},{"$f":"Dane!CN3","v":0}]
[2,{"$f":"Dane!D4&\"\n\"&Dane!E4&\"\n\"&Dane!F4","v":"Agencja Analiz i Doradztwa Personalnego Remigiusz Koc\nul. Gdańska 105/4\n85-022 Bydgoszcz"},{"$f":"Dane!I4","v":{"v":16728,"d":"16,728.00 zł"}},{"$f":"Dane!J4","v":1471},{"$f":"Dane!K4","v":1},{"$f":"Dane!L4","v":0},{"$f":"Dane!S4","v":0},{"$f":"Dane!T4","v":0},{"$f":"Dane!U4","v":0},{"$f":"Dane!V4","v":0},{"$f":"Dane!AC4","v":0},{"$f":"Dane!AD4","v":0},{"$f":"Dane!AE4","v":0},{"$f":"Dane!AF4","v":0},{"$f":"Dane!AM4","v":0},{"$f":"Dane!AN4","v":0},{"$f":"Dane!AO4","v":0},{"$f":"Dane!AP4","v":0},{"$f":"Dane!AW4","v":0},{"$f":"Dane!AX4","v":0},{"$f":"Dane!AY4","v":0},{"$f":"Dane!AZ4","v":0},{"$f":"Dane!BG4","v":0},{"$f":"Dane!BH4","v":0},{"$f":"Dane!BI4","v":0},{"$f":"Dane!BJ4","v":0},{"$f":"Dane!BQ4","v":0},{"$f":"Dane!BR4","v":0},{"$f":"Dane!BS4","v":0},{"$f":"Dane!BT4","v":0},{"$f":"Dane!CA4","v":0},{"$f":"Dane!CB4","v":0},{"$f":"Dane!CC4","v":0},{"$f":"Dane!CD4","v":0},{"$f":"Dane!CK4","v":0},{"$f":"Dane!CL4","v":0},{"$f":"Dane!CM4","v":0},{"$f":"Dane!CN4","v":0}]
[3,{"$f":"Dane!D5&\"\n\"&Dane!E5&\"\n\"&Dane!F5","v":"IMMOQEE Sp. z o.o.\nul. Karola Chodkiewicza 3 lok. U 10\n02-593 Warszawa"},{"$f":"Dane!I5","v":{"v":19500,"d":"19,500.00 zł"}},{"$f":"Dane!J5","v":600},{"$f":"Dane!K5","v":3},{"$f":"Dane!L5","v":0},{"$f":"Dane!S5","v":0},{"$f":"Dane!T5","v":0},{"$f":"Dane!U5","v":0},{"$f":"Dane!V5","v":0},{"$f":"Dane!AC5","v":0},{"$f":"Dane!AD5","v":0},{"$f":"Dane!AE5","v":0},{"$f":"Dane!AF5","v":0},{"$f":"Dane!AM5","v":0},{"$f":"Dane!AN5","v":0},{"$f":"Dane!AO5","v":0},{"$f":"Dane!AP5","v":0},{"$f":"Dane!AW5","v":0},{"$f":"Dane!AX5","v":0},{"$f":"Dane!AY5","v":0},{"$f":"Dane!AZ5","v":0},{"$f":"Dane!BG5","v":0},{"$f":"Dane!BH5","v":0},{"$f":"Dane!BI5","v":0},{"$f":"Dane!BJ5","v":0},{"$f":"Dane!BQ5","v":0},{"$f":"Dane!BR5","v":0},{"$f":"Dane!BS5","v":0},{"$f":"Dane!BT5","v":0},{"$f":"Dane!CA5","v":0},{"$f":"Dane!CB5","v":0},{"$f":"Dane!CC5","v":0},{"$f":"Dane!CD5","v":0},{"$f":"Dane!CK5","v":0},{"$f":"Dane!CL5","v":0},{"$f":"Dane!CM5","v":0},{"$f":"Dane!CN5","v":0}]
[4,{"$f":"Dane!D6&\"\n\"&Dane!E6&\"\n\"&Dane!F6","v":"Brainstorm Group Sp. z o.o. \nul. Perła 10\n41-300 Dabrowa Górnicza"},{"$f":"Dane!I6","v":{"v":73800,"d":"73,800.00 zł"}},{"$f":"Dane!J6","v":1916},{"$f":"Dane!K6","v":1},{"$f":"Dane!L6","v":0},{"$f":"Dane!S6","v":0},{"$f":"Dane!T6","v":0},{"$f":"Dane!U6","v":0},{"$f":"Dane!V6","v":0},{"$f":"Dane!AC6","v":0},{"$f":"Dane!AD6","v":0},{"$f":"Dane!AE6","v":0},{"$f":"Dane!AF6","v":0},{"$f":"Dane!AM6","v":0},{"$f":"Dane!AN6","v":0},{"$f":"Dane!AO6","v":0},{"$f":"Dane!AP6","v":0},{"$f":"Dane!AW6","v":0},{"$f":"Dane!AX6","v":0},{"$f":"Dane!AY6","v":0},{"$f":"Dane!AZ6","v":0},{"$f":"Dane!BG6","v":0},{"$f":"Dane!BH6","v":0},{"$f":"Dane!BI6","v":0},{"$f":"Dane!BJ6","v":0},{"$f":"Dane!BQ6","v":0},{"$f":"Dane!BR6","v":0},{"$f":"Dane!BS6","v":0},{"$f":"Dane!BT6","v":0},{"$f":"Dane!CA6","v":0},{"$f":"Dane!CB6","v":0},{"$f":"Dane!CC6","v":0},{"$f":"Dane!CD6","v":0},{"$f":"Dane!CK6","v":0},{"$f":"Dane!CL6","v":0},{"$f":"Dane!CM6","v":0},{"$f":"Dane!CN6","v":0}]
[5,{"$f":"Dane!D7&\"\n\"&Dane!E7&\"\n\"&Dane!F7","v":"Slow Life&Business\nul. Szafirowa  78\n63-460 Nowe Skalmierzyce"},{"$f":"Dane!I7","v":"warsztat jednodniowy 1000,00zł netto, warsztat dwudniowy 1800,00zł"},{"$f":"Dane!J7","v":570},{"$f":"Dane!K7","v":"między 10 a 16 lipca br."},{"$f":"Dane!L7","v":0},{"$f":"Dane!S7","v":0},{"$f":"Dane!T7","v":0},{"$f":"Dane!U7","v":0},{"$f":"Dane!V7","v":0},{"$f":"Dane!AC7","v":0},{"$f":"Dane!AD7","v":0},{"$f":"Dane!AE7","v":0},{"$f":"Dane!AF7","v":0},{"$f":"Dane!AM7","v":0},{"$f":"Dane!AN7","v":0},{"$f":"Dane!AO7","v":0},{"$f":"Dane!AP7","v":0},{"$f":"Dane!AW7","v":0},{"$f":"Dane!AX7","v":0},{"$f":"Dane!AY7","v":0},{"$f":"Dane!AZ7","v":0},{"$f":"Dane!BG7","v":0},{"$f":"Dane!BH7","v":0},{"$f":"Dane!BI7","v":0},{"$f":"Dane!BJ7","v":0},{"$f":"Dane!BQ7","v":0},{"$f":"Dane!BR7","v":0},{"$f":"Dane!BS7","v":0},{"$f":"Dane!BT7","v":0},{"$f":"Dane!CA7","v":0},{"$f":"Dane!CB7","v":0},{"$f":"Dane!CC7","v":0},{"$f":"Dane!CD7","v":0},{"$f":"Dane!CK7","v":0},{"$f":"Dane!CL7","v":0},{"$f":"Dane!CM7","v":0},{"$f":"Dane!CN7","v":0}]
[6,{"$f":"Dane!D8&\"\n\"&Dane!E8&\"\n\"&Dane!F8","v":"RAJOS COSULTING Rafał Stelmasik\nul. C.K.Norwida 1\n37-550 Radymno"},{"$f":"Dane!I8","v":{"v":10880,"d":"10,880.00 zł"}},{"$f":"Dane!J8","v":300},{"$f":"Dane!K8","v":3},{"$f":"Dane!L8","v":0},{"$f":"Dane!S8","v":0},{"$f":"Dane!T8","v":0},{"$f":"Dane!U8","v":0},{"$f":"Dane!V8","v":0},{"$f":"Dane!AC8","v":0},{"$f":"Dane!AD8","v":0},{"$f":"Dane!AE8","v":0},{"$f":"Dane!AF8","v":0},{"$f":"Dane!AM8","v":0},{"$f":"Dane!AN8","v":0},{"$f":"Dane!AO8","v":0},{"$f":"Dane!AP8","v":0},{"$f":"Dane!AW8","v":0},{"$f":"Dane!AX8","v":0},{"$f":"Dane!AY8","v":0},{"$f":"Dane!AZ8","v":0},{"$f":"Dane!BG8","v":0},{"$f":"Dane!BH8","v":0},{"$f":"Dane!BI8","v":0},{"$f":"Dane!BJ8","v":0},{"$f":"Dane!BQ8","v":0},{"$f":"Dane!BR8","v":0},{"$f":"Dane!BS8","v":0},{"$f":"Dane!BT8","v":0},{"$f":"Dane!CA8","v":0},{"$f":"Dane!CB8","v":0},{"$f":"Dane!CC8","v":0},{"$f":"Dane!CD8","v":0},{"$f":"Dane!CK8","v":0},{"$f":"Dane!CL8","v":0},{"$f":"Dane!CM8","v":0},{"$f":"Dane!CN8","v":0}]
[7,{"$f":"Dane!D9&\"\n\"&Dane!E9&\"\n\"&Dane!F9","v":"Centrum Szkoleń Wielozawodowych DELTA\nul. Sandomierska 26a pokój nr 9\n27-400 Ostrowiec w."},{"$f":"Dane!I9","v":{"v":10055,"d":"10,055.00 zł"}},{"$f":"Dane!J9","v":300},{"$f":"Dane!K9","v":2},{"$f":"Dane!L9","v":0},{"$f":"Dane!S9","v":0},{"$f":"Dane!T9","v":0},{"$f":"Dane!U9","v":0},{"$f":"Dane!V9","v":0},{"$f":"Dane!AC9","v":0},{"$f":"Dane!AD9","v":0},{"$f":"Dane!AE9","v":0},{"$f":"Dane!AF9","v":0},{"$f":"Dane!AM9","v":0},{"$f":"Dane!AN9","v":0},{"$f":"Dane!AO9","v":0},{"$f":"Dane!AP9","v":0},{"$f":"Dane!AW9","v":0},{"$f":"Dane!AX9","v":0},{"$f":"Dane!AY9","v":0},{"$f":"Dane!AZ9","v":0},{"$f":"Dane!BG9","v":0},{"$f":"Dane!BH9","v":0},{"$f":"Dane!BI9","v":0},{"$f":"Dane!BJ9","v":0},{"$f":"Dane!BQ9","v":0},{"$f":"Dane!BR9","v":0},{"$f":"Dane!BS9","v":0},{"$f":"Dane!BT9","v":0},{"$f":"Dane!CA9","v":0},{"$f":"Dane!CB9","v":0},{"$f":"Dane!CC9","v":0},{"$f":"Dane!CD9","v":0},{"$f":"Dane!CK9","v":0},{"$f":"Dane!CL9","v":0},{"$f":"Dane!CM9","v":0},{"$f":"Dane!CN9","v":0}]
[8,{"$f":"Dane!D10&\"\n\"&Dane!E10&\"\n\"&Dane!F10","v":"Coach and Go Joanna Chorwacka\nul. Sosnowa 6d\n86-300 Grudziądz"},{"$f":"Dane!I10","v":{"v":16000,"d":"16,000.00 zł"}},{"$f":"Dane!J10","v":500},{"$f":"Dane!K10","v":2},{"$f":"Dane!L10","v":0},{"$f":"Dane!S10","v":0},{"$f":"Dane!T10","v":0},{"$f":"Dane!U10","v":0},{"$f":"Dane!V10","v":0},{"$f":"Dane!AC10","v":0},{"$f":"Dane!AD10","v":0},{"$f":"Dane!AE10","v":0},{"$f":"Dane!AF10","v":0},{"$f":"Dane!AM10","v":0},{"$f":"Dane!AN10","v":0},{"$f":"Dane!AO10","v":0},{"$f":"Dane!AP10","v":0},{"$f":"Dane!AW10","v":0},{"$f":"Dane!AX10","v":0},{"$f":"Dane!AY10","v":0},{"$f":"Dane!AZ10","v":0},{"$f":"Dane!BG10","v":0},{"$f":"Dane!BH10","v":0},{"$f":"Dane!BI10","v":0},{"$f":"Dane!BJ10","v":0},{"$f":"Dane!BQ10","v":0},{"$f":"Dane!BR10","v":0},{"$f":"Dane!BS10","v":0},{"$f":"Dane!BT10","v":0},{"$f":"Dane!CA10","v":0},{"$f":"Dane!CB10","v":0},{"$f":"Dane!CC10","v":0},{"$f":"Dane!CD10","v":0},{"$f":"Dane!CK10","v":0},{"$f":"Dane!CL10","v":0},{"$f":"Dane!CM10","v":0},{"$f":"Dane!CN10","v":0}]
[9,{"$f":"Dane!D11&\"\n\"&Dane!E11&\"\n\"&Dane!F11","v":"Moja Firma Elzbieta Kowalska\nul. Uniwersytecka 33/35 lok. 36\n90-233 Łódź"},{"$f":"Dane!I11","v":{"v":32000,"d":"32,000.00 zł"}},{"$f":"Dane!J11","v":3038},{"$f":"Dane!K11","v":1},{"$f":"Dane!L11","v":0},{"$f":"Dane!S11","v":0},{"$f":"Dane!T11","v":0},{"$f":"Dane!U11","v":0},{"$f":"Dane!V11","v":0},{"$f":"Dane!AC11","v":0},{"$f":"Dane!AD11","v":0},{"$f":"Dane!AE11","v":0},{"$f":"Dane!AF11","v":0},{"$f":"Dane!AM11","v":0},{"$f":"Dane!AN11","v":0},{"$f":"Dane!AO11","v":0},{"$f":"Dane!AP11","v":0},{"$f":"Dane!AW11","v":0},{"$f":"Dane!AX11","v":0},{"$f":"Dane!AY11","v":0},{"$f":"Dane!AZ11","v":0},{"$f":"Dane!BG11","v":0},{"$f":"Dane!BH11","v":0},{"$f":"Dane!BI11","v":0},{"$f":"Dane!BJ11","v":0},{"$f":"Dane!BQ11","v":0},{"$f":"Dane!BR11","v":0},{"$f":"Dane!BS11","v":0},{"$f":"Dane!BT11","v":0},{"$f":"Dane!CA11","v":0},{"$f":"Dane!CB11","v":0},{"$f":"Dane!CC11","v":0},{"$f":"Dane!CD11","v":0},{"$f":"Dane!CK11","v":0},{"$f":"Dane!CL11","v":0},{"$f":"Dane!CM11","v":0},{"$f":"Dane!CN11","v":0}]
[10,{"$f":"Dane!D12&\"\n\"&Dane!E12&\"\n\"&Dane!F12","v":"LCE LOGOS Centrum Edukacyjne\nul. Ks.Kard.Wyszyńskiego 6 lok 44\n18-400 Łomża"},{"$f":"Dane!I12","v":{"v":12160,"d":"12,160.00 zł"}},{"$f":"Dane!J12","v":922},{"$f":"Dane!K12","v":1},{"$f":"Dane!L12","v":0},{"$f":"Dane!S12","v":0},{"$f":"Dane!T12","v":0},{"$f":"Dane!U12","v":0},{"$f":"Dane!V12","v":0},{"$f":"Dane!AC12","v":0},{"$f":"Dane!AD12","v":0},{"$f":"Dane!AE12","v":0},{"$f":"Dane!AF12","v":0},{"$f":"Dane!AM12","v":0},{"$f":"Dane!AN12","v":0},{"$f":"Dane!AO12","v":0},{"$f":"Dane!AP12","v":0},{"$f":"Dane!AW12","v":0},{"$f":"Dane!AX12","v":0},{"$f":"Dane!AY12","v":0},{"$f":"Dane!AZ12","v":0},{"$f":"Dane!BG12","v":0},{"$f":"Dane!BH12","v":0},{"$f":"Dane!BI12","v":0},{"$f":"Dane!BJ12","v":0},{"$f":"Dane!BQ12","v":0},{"$f":"Dane!BR12","v":0},{"$f":"Dane!BS12","v":0},{"$f":"Dane!BT12","v":0},{"$f":"Dane!CA12","v":0},{"$f":"Dane!CB12","v":0},{"$f":"Dane!CC12","v":0},{"$f":"Dane!CD12","v":0},{"$f":"Dane!CK12","v":0},{"$f":"Dane!CL12","v":0},{"$f":"Dane!CM12","v":0},{"$f":"Dane!CN12","v":0}]
[11,{"$f":"Dane!D13&\"\n\"&Dane!E13&\"\n\"&Dane!F13","v":"SEKA S.A. \nul. Bernardyńska 13\n85-029 Bydgoszcz"},{"$f":"Dane!I13","v":{"v":17500,"d":"17,500.00 zł"}},{"$f":"Dane!J13","v":3054},{"$f":"Dane!K13","v":1},{"$f":"Dane!L13","v":0},{"$f":"Dane!S13","v":0},{"$f":"Dane!T13","v":0},{"$f":"Dane!U13","v":0},{"$f":"Dane!V13","v":0},{"$f":"Dane!AC13","v":0},{"$f":"Dane!AD13","v":0},{"$f":"Dane!AE13","v":0},{"$f":"Dane!AF13","v":0},{"$f":"Dane!AM13","v":0},{"$f":"Dane!AN13","v":0},{"$f":"Dane!AO13","v":0},{"$f":"Dane!AP13","v":0},{"$f":"Dane!AW13","v":0},{"$f":"Dane!AX13","v":0},{"$f":"Dane!AY13","v":0},{"$f":"Dane!AZ13","v":0},{"$f":"Dane!BG13","v":0},{"$f":"Dane!BH13","v":0},{"$f":"Dane!BI13","v":0},{"$f":"Dane!BJ13","v":0},{"$f":"Dane!BQ13","v":0},{"$f":"Dane!BR13","v":0},{"$f":"Dane!BS13","v":0},{"$f":"Dane!BT13","v":0},{"$f":"Dane!CA13","v":0},{"$f":"Dane!CB13","v":0},{"$f":"Dane!CC13","v":0},{"$f":"Dane!CD13","v":0},{"$f":"Dane!CK13","v":0},{"$f":"Dane!CL13","v":0},{"$f":"Dane!CM13","v":0},{"$f":"Dane!CN13","v":0}]
[12,{"$f":"Dane!D14&\"\n\"&Dane!E14&\"\n\"&Dane!F14","v":"Polska Akademia Oświaty Sp. z o.o.\nul. Krańcowa 17/1\n02-493 Warszawa"},{"$f":"Dane!I14","v":{"v":32000,"d":"32,000.00 zł"}},{"$f":"Dane!J14","v":6058},{"$f":"Dane!K14","v":1},{"$f":"Dane!L14","v":0},{"$f":"Dane!S14","v":0},{"$f":"Dane!T14","v":0},{"$f":"Dane!U14","v":0},{"$f":"Dane!V14","v":0},{"$f":"Dane!AC14","v":0},{"$f":"Dane!AD14","v":0},{"$f":"Dane!AE14","v":0},{"$f":"Dane!AF14","v":0},{"$f":"Dane!AM14","v":0},{"$f":"Dane!AN14","v":0},{"$f":"Dane!AO14","v":0},{"$f":"Dane!AP14","v":0},{"$f":"Dane!AW14","v":0},{"$f":"Dane!AX14","v":0},{"$f":"Dane!AY14","v":0},{"$f":"Dane!AZ14","v":0},{"$f":"Dane!BG14","v":0},{"$f":"Dane!BH14","v":0},{"$f":"Dane!BI14","v":0},{"$f":"Dane!BJ14","v":0},{"$f":"Dane!BQ14","v":0},{"$f":"Dane!BR14","v":0},{"$f":"Dane!BS14","v":0},{"$f":"Dane!BT14","v":0},{"$f":"Dane!CA14","v":0},{"$f":"Dane!CB14","v":0},{"$f":"Dane!CC14","v":0},{"$f":"Dane!CD14","v":0},{"$f":"Dane!CK14","v":0},{"$f":"Dane!CL14","v":0},{"$f":"Dane!CM14","v":0},{"$f":"Dane!CN14","v":0}]
[13,{"$f":"Dane!D15&\"\n\"&Dane!E15&\"\n\"&Dane!F15","v":"0\n0\n0"},{"$f":"Dane!I15","v":0},{"$f":"Dane!J15","v":0},{"$f":"Dane!K15","v":0},{"$f":"Dane!L15","v":0},{"$f":"Dane!S15","v":0},{"$f":"Dane!T15","v":0},{"$f":"Dane!U15","v":0},{"$f":"Dane!V15","v":0},{"$f":"Dane!AC15","v":0},{"$f":"Dane!AD15","v":0},{"$f":"Dane!AE15","v":0},{"$f":"Dane!AF15","v":0},{"$f":"Dane!AM15","v":0},{"$f":"Dane!AN15","v":0},{"$f":"Dane!AO15","v":0},{"$f":"Dane!AP15","v":0},{"$f":"Dane!AW15","v":0},{"$f":"Dane!AX15","v":0},{"$f":"Dane!AY15","v":0},{"$f":"Dane!AZ15","v":0},{"$f":"Dane!BG15","v":0},{"$f":"Dane!BH15","v":0},{"$f":"Dane!BI15","v":0},{"$f":"Dane!BJ15","v":0},{"$f":"Dane!BQ15","v":0},{"$f":"Dane!BR15","v":0},{"$f":"Dane!BS15","v":0},{"$f":"Dane!BT15","v":0},{"$f":"Dane!CA15","v":0},{"$f":"Dane!CB15","v":0},{"$f":"Dane!CC15","v":0},{"$f":"Dane!CD15","v":0},{"$f":"Dane!CK15","v":0},{"$f":"Dane!CL15","v":0},{"$f":"Dane!CM15","v":0},{"$f":"Dane!CN15","v":0}]
[14,{"$f":"Dane!D16&\"\n\"&Dane!E16&\"\n\"&Dane!F16","v":"0\n0\n0"},{"$f":"Dane!I16","v":0},{"$f":"Dane!J16","v":0},{"$f":"Dane!K16","v":0},{"$f":"Dane!L16","v":0},{"$f":"Dane!S16","v":0},{"$f":"Dane!T16","v":0},{"$f":"Dane!U16","v":0},{"$f":"Dane!V16","v":0},{"$f":"Dane!AC16","v":0},{"$f":"Dane!AD16","v":0},{"$f":"Dane!AE16","v":0},{"$f":"Dane!AF16","v":0},{"$f":"Dane!AM16","v":0},{"$f":"Dane!AN16","v":0},{"$f":"Dane!AO16","v":0},{"$f":"Dane!AP16","v":0},{"$f":"Dane!AW16","v":0},{"$f":"Dane!AX16","v":0},{"$f":"Dane!AY16","v":0},{"$f":"Dane!AZ16","v":0},{"$f":"Dane!BG16","v":0},{"$f":"Dane!BH16","v":0},{"$f":"Dane!BI16","v":0},{"$f":"Dane!BJ16","v":0},{"$f":"Dane!BQ16","v":0},{"$f":"Dane!BR16","v":0},{"$f":"Dane!BS16","v":0},{"$f":"Dane!BT16","v":0},{"$f":"Dane!CA16","v":0},{"$f":"Dane!CB16","v":0},{"$f":"Dane!CC16","v":0},{"$f":"Dane!CD16","v":0},{"$f":"Dane!CK16","v":0},{"$f":"Dane!CL16","v":0},{"$f":"Dane!CM16","v":0},{"$f":"Dane!CN16","v":0}]
[15,{"$f":"Dane!D17&\"\n\"&Dane!E17&\"\n\"&Dane!F17","v":"0\n0\n0"},{"$f":"Dane!I17","v":0},{"$f":"Dane!J17","v":0},{"$f":"Dane!K17","v":0},{"$f":"Dane!L17","v":0},{"$f":"Dane!S17","v":0},{"$f":"Dane!T17","v":0},{"$f":"Dane!U17","v":0},{"$f":"Dane!V17","v":0},{"$f":"Dane!AC17","v":0},{"$f":"Dane!AD17","v":0},{"$f":"Dane!AE17","v":0},{"$f":"Dane!AF17","v":0},{"$f":"Dane!AM17","v":0},{"$f":"Dane!AN17","v":0},{"$f":"Dane!AO17","v":0},{"$f":"Dane!AP17","v":0},{"$f":"Dane!AW17","v":0},{"$f":"Dane!AX17","v":0},{"$f":"Dane!AY17","v":0},{"$f":"Dane!AZ17","v":0},{"$f":"Dane!BG17","v":0},{"$f":"Dane!BH17","v":0},{"$f":"Dane!BI17","v":0},{"$f":"Dane!BJ17","v":0},{"$f":"Dane!BQ17","v":0},{"$f":"Dane!BR17","v":0},{"$f":"Dane!BS17","v":0},{"$f":"Dane!BT17","v":0},{"$f":"Dane!CA17","v":0},{"$f":"Dane!CB17","v":0},{"$f":"Dane!CC17","v":0},{"$f":"Dane!CD17","v":0},{"$f":"Dane!CK17","v":0},{"$f":"Dane!CL17","v":0},{"$f":"Dane!CM17","v":0},{"$f":"Dane!CN17","v":0}]
[16,{"$f":"Dane!D18&\"\n\"&Dane!E18&\"\n\"&Dane!F18","v":"0\n0\n0"},{"$f":"Dane!I18","v":0},{"$f":"Dane!J18","v":0},{"$f":"Dane!K18","v":0},{"$f":"Dane!L18","v":0},{"$f":"Dane!S18","v":0},{"$f":"Dane!T18","v":0},{"$f":"Dane!U18","v":0},{"$f":"Dane!V18","v":0},{"$f":"Dane!AC18","v":0},{"$f":"Dane!AD18","v":0},{"$f":"Dane!AE18","v":0},{"$f":"Dane!AF18","v":0},{"$f":"Dane!AM18","v":0},{"$f":"Dane!AN18","v":0},{"$f":"Dane!AO18","v":0},{"$f":"Dane!AP18","v":0},{"$f":"Dane!AW18","v":0},{"$f":"Dane!AX18","v":0},{"$f":"Dane!AY18","v":0},{"$f":"Dane!AZ18","v":0},{"$f":"Dane!BG18","v":0},{"$f":"Dane!BH18","v":0},{"$f":"Dane!BI18","v":0},{"$f":"Dane!BJ18","v":0},{"$f":"Dane!BQ18","v":0},{"$f":"Dane!BR18","v":0},{"$f":"Dane!BS18","v":0},{"$f":"Dane!BT18","v":0},{"$f":"Dane!CA18","v":0},{"$f":"Dane!CB18","v":0},{"$f":"Dane!CC18","v":0},{"$f":"Dane!CD18","v":0},{"$f":"Dane!CK18","v":0},{"$f":"Dane!CL18","v":0},{"$f":"Dane!CM18","v":0},{"$f":"Dane!CN18","v":0}]
[17,{"$f":"Dane!D19&\"\n\"&Dane!E19&\"\n\"&Dane!F19","v":"0\n0\n0"},{"$f":"Dane!I19","v":0},{"$f":"Dane!J19","v":0},{"$f":"Dane!K19","v":0},{"$f":"Dane!L19","v":0},{"$f":"Dane!S19","v":0},{"$f":"Dane!T19","v":0},{"$f":"Dane!U19","v":0},{"$f":"Dane!V19","v":0},{"$f":"Dane!AC19","v":0},{"$f":"Dane!AD19","v":0},{"$f":"Dane!AE19","v":0},{"$f":"Dane!AF19","v":0},{"$f":"Dane!AM19","v":0},{"$f":"Dane!AN19","v":0},{"$f":"Dane!AO19","v":0},{"$f":"Dane!AP19","v":0},{"$f":"Dane!AW19","v":0},{"$f":"Dane!AX19","v":0},{"$f":"Dane!AY19","v":0},{"$f":"Dane!AZ19","v":0},{"$f":"Dane!BG19","v":0},{"$f":"Dane!BH19","v":0},{"$f":"Dane!BI19","v":0},{"$f":"Dane!BJ19","v":0},{"$f":"Dane!BQ19","v":0},{"$f":"Dane!BR19","v":0},{"$f":"Dane!BS19","v":0},{"$f":"Dane!BT19","v":0},{"$f":"Dane!CA19","v":0},{"$f":"Dane!CB19","v":0},{"$f":"Dane!CC19","v":0},{"$f":"Dane!CD19","v":0},{"$f":"Dane!CK19","v":0},{"$f":"Dane!CL19","v":0},{"$f":"Dane!CM19","v":0},{"$f":"Dane!CN19","v":0}]
[18,{"$f":"Dane!D20&\"\n\"&Dane!E20&\"\n\"&Dane!F20","v":"0\n0\n0"},{"$f":"Dane!I20","v":0},{"$f":"Dane!J20","v":0},{"$f":"Dane!K20","v":0},{"$f":"Dane!L20","v":0},{"$f":"Dane!S20","v":0},{"$f":"Dane!T20","v":0},{"$f":"Dane!U20","v":0},{"$f":"Dane!V20","v":0},{"$f":"Dane!AC20","v":0},{"$f":"Dane!AD20","v":0},{"$f":"Dane!AE20","v":0},{"$f":"Dane!AF20","v":0},{"$f":"Dane!AM20","v":0},{"$f":"Dane!AN20","v":0},{"$f":"Dane!AO20","v":0},{"$f":"Dane!AP20","v":0},{"$f":"Dane!AW20","v":0},{"$f":"Dane!AX20","v":0},{"$f":"Dane!AY20","v":0},{"$f":"Dane!AZ20","v":0},{"$f":"Dane!BG20","v":0},{"$f":"Dane!BH20","v":0},{"$f":"Dane!BI20","v":0},{"$f":"Dane!BJ20","v":0},{"$f":"Dane!BQ20","v":0},{"$f":"Dane!BR20","v":0},{"$f":"Dane!BS20","v":0},{"$f":"Dane!BT20","v":0},{"$f":"Dane!CA20","v":0},{"$f":"Dane!CB20","v":0},{"$f":"Dane!CC20","v":0},{"$f":"Dane!CD20","v":0},{"$f":"Dane!CK20","v":0},{"$f":"Dane!CL20","v":0},{"$f":"Dane!CM20","v":0},{"$f":"Dane!CN20","v":0}]
[19,{"$f":"Dane!D21&\"\n\"&Dane!E21&\"\n\"&Dane!F21","v":"0\n0\n0"},{"$f":"Dane!I21","v":0},{"$f":"Dane!J21","v":0},{"$f":"Dane!K21","v":0},{"$f":"Dane!L21","v":0},{"$f":"Dane!S21","v":0},{"$f":"Dane!T21","v":0},{"$f":"Dane!U21","v":0},{"$f":"Dane!V21","v":0},{"$f":"Dane!AC21","v":0},{"$f":"Dane!AD21","v":0},{"$f":"Dane!AE21","v":0},{"$f":"Dane!AF21","v":0},{"$f":"Dane!AM21","v":0},{"$f":"Dane!AN21","v":0},{"$f":"Dane!AO21","v":0},{"$f":"Dane!AP21","v":0},{"$f":"Dane!AW21","v":0},{"$f":"Dane!AX21","v":0},{"$f":"Dane!AY21","v":0},{"$f":"Dane!AZ21","v":0},{"$f":"Dane!BG21","v":0},{"$f":"Dane!BH21","v":0},{"$f":"Dane!BI21","v":0},{"$f":"Dane!BJ21","v":0},{"$f":"Dane!BQ21","v":0},{"$f":"Dane!BR21","v":0},{"$f":"Dane!BS21","v":0},{"$f":"Dane!BT21","v":0},{"$f":"Dane!CA21","v":0},{"$f":"Dane!CB21","v":0},{"$f":"Dane!CC21","v":0},{"$f":"Dane!CD21","v":0},{"$f":"Dane!CK21","v":0},{"$f":"Dane!CL21","v":0},{"$f":"Dane!CM21","v":0},{"$f":"Dane!CN21","v":0}]
[20,{"$f":"Dane!D22&\"\n\"&Dane!E22&\"\n\"&Dane!F22","v":"0\n0\n0"},{"$f":"Dane!I22","v":0},{"$f":"Dane!J22","v":0},{"$f":"Dane!K22","v":0},{"$f":"Dane!L22","v":0},{"$f":"Dane!S22","v":0},{"$f":"Dane!T22","v":0},{"$f":"Dane!U22","v":0},{"$f":"Dane!V22","v":0},{"$f":"Dane!AC22","v":0},{"$f":"Dane!AD22","v":0},{"$f":"Dane!AE22","v":0},{"$f":"Dane!AF22","v":0},{"$f":"Dane!AM22","v":0},{"$f":"Dane!AN22","v":0},{"$f":"Dane!AO22","v":0},{"$f":"Dane!AP22","v":0},{"$f":"Dane!AW22","v":0},{"$f":"Dane!AX22","v":0},{"$f":"Dane!AY22","v":0},{"$f":"Dane!AZ22","v":0},{"$f":"Dane!BG22","v":0},{"$f":"Dane!BH22","v":0},{"$f":"Dane!BI22","v":0},{"$f":"Dane!BJ22","v":0},{"$f":"Dane!BQ22","v":0},{"$f":"Dane!BR22","v":0},{"$f":"Dane!BS22","v":0},{"$f":"Dane!BT22","v":0},{"$f":"Dane!CA22","v":0},{"$f":"Dane!CB22","v":0},{"$f":"Dane!CC22","v":0},{"$f":"Dane!CD22","v":0},{"$f":"Dane!CK22","v":0},{"$f":"Dane!CL22","v":0},{"$f":"Dane!CM22","v":0},{"$f":"Dane!CN22","v":0}]
[]
["Termin wykonania zamówienia: I warsztat  …. dni od dnia podpisania umowy do 31.07.2018r.\nOkres gwarancji:  nie dotyczy\nWarunki płatności: przelew 30 dni"]
[]
["UWAGA: Wykonawca w terminie 3 dni od dnia zamieszczenia na stronie internetowej Zamawiającego informacji, o której mowa w art. 86 ust. 5 ustawy Pzp, przekaże Zamawiającemu oświadczenie w formie pisemnej o przynależności lub braku przynależności do tej samej grupy kapitałowej, o której mowa w art. 24 ust. 1 pkt 23 ustawy Pzp. Wraz ze złożonym oświadczeniem, wykonawca może przedstawić dowody, że powiązania z innym Wykonawcą nie prowadzą do zakłócenia konkurencji w postepowaniu o udzielenie zamówienia."]

{"sheet":"Punktacja","index":3,"n_rows":52,"n_cols":47,"rows_kept":52,"merged":[[2,0,3,0],[2,1,3,1],[2,2,2,3],[2,7,2,8],[2,12,2,13],[2,17,2,18],[2,22,2,23],[2,27,2,28],[2,32,2,33],[2,37,2,38],[2,42,2,43],[2,44,2,45],[30,0,31,0],[30,1,31,1],[30,2,30,6],[30,7,30,11],[30,12,30,16],[30,17,30,21],[30,22,30,26],[30,27,30,31],[30,32,30,36],[30,37,30,41],[30,42,30,46]]}
[null,"R/M",{"$f":"Wnioski!$K2","v":"M"},{"$f":"Wnioski!$N2","v":"R"},{"$f":"Wnioski!$Q2","v":"M"},{"$f":"Wnioski!$T2","v":0},null,{"$f":"Wnioski!$K3","v":"M"},{"$f":"Wnioski!$N3","v":0},{"$f":"Wnioski!$Q3","v":0},{"$f":"Wnioski!$T3","v":0},null,{"$f":"Wnioski!$K4","v":"M"},{"$f":"Wnioski!$N4","v":0},{"$f":"Wnioski!$Q4","v":0},{"$f":"Wnioski!$T4","v":0},null,{"$f":"Wnioski!$K5","v":"M"},{"$f":"Wnioski!$N5","v":0},{"$f":"Wnioski!$Q5","v":0},{"$f":"Wnioski!$T5","v":0},null,{"$f":"Wnioski!$K6","v":"M"},{"$f":"Wnioski!$N6","v":0},{"$f":"Wnioski!$Q6","v":0},{"$f":"Wnioski!$T6","v":0},null,{"$f":"Wnioski!$K7","v":"M"},{"$f":"Wnioski!$N7","v":0},{"$f":"Wnioski!$Q7","v":0},{"$f":"Wnioski!$T7","v":0},null,{"$f":"Wnioski!$K8","v":"M"},{"$f":"Wnioski!$N8","v":0},{"$f":"Wnioski!$Q8","v":0},{"$f":"Wnioski!$T8","v":0},null,{"$f":"Wnioski!$K9","v":"M"},{"$f":"Wnioski!$N9","v":0},{"$f":"Wnioski!$Q9","v":0},{"$f":"Wnioski!$T9","v":0},null,{"$f":"Wnioski!$K10","v":"M"},{"$f":"Wnioski!$N10","v":0},{"$f":"Wnioski!$Q10","v":0},{"$f":"Wnioski!$T10","v":0}]
[null,"Waga",{"$f":"Wnioski!$J2","v":50},{"$f":"Wnioski!$M2","v":40},{"$f":"Wnioski!$P2","v":10},{"$f":"Wnioski!$S2","v":0},null,{"$f":"Wnioski!$J3","v":60},{"$f":"Wnioski!$M3","v":0},{"$f":"Wnioski!$P3","v":0},{"$f":"Wnioski!$S3","v":0},null,{"$f":"Wnioski!$J4","v":60},{"$f":"Wnioski!$M4","v":0},{"$f":"Wnioski!$P4","v":0},{"$f":"Wnioski!$S4","v":0},null,{"$f":"Wnioski!$J5","v":60},{"$f":"Wnioski!$M5","v":0},{"$f":"Wnioski!$P5","v":0},{"$f":"Wnioski!$S5","v":0},null,{"$f":"Wnioski!$J6","v":60},{"$f":"Wnioski!$M6","v":0},{"$f":"Wnioski!$P6","v":0},{"$f":"Wnioski!$S6","v":0},null,{"$f":"Wnioski!$J7","v":60},{"$f":"Wnioski!$M7","v":0},{"$f":"Wnioski!$P7","v":0},{"$f":"Wnioski!$S7","v":0},null,{"$f":"Wnioski!$J8","v":60},{"$f":"Wnioski!$M8","v":0},{"$f":"Wnioski!$P8","v":0},{"$f":"Wnioski!$S8","v":0},null,{"$f":"Wnioski!$J9","v":60},{"$f":"Wnioski!$M9","v":0},{"$f":"Wnioski!$P9","v":0},{"$f":"Wnioski!$S9","v":0},null,{"$f":"Wnioski!$J10","v":60},{"$f":"Wnioski!$M10","v":0},{"$f":"Wnioski!$P10","v":0},{"$f":"Wnioski!$S10","v":0}]
[{"$f":"Zestawienie!A8","v":"Nr oferty"},"Nazwa Wykonawcy",{"$nulls":5},{"$f":"Zestawienie!G8","v":"Zadanie 2"},{"$f":"Zestawienie!H8","v":0},{"$nulls":3},{"$f":"Zestawienie!K8","v":"Zadanie 3"},{"$f":"Zestawienie!L8","v":0},{"$nulls":3},{"$f":"Zestawienie!O8","v":"Zadanie 4"},{"$f":"Zestawienie!P8","v":0},{"$nulls":3},{"$f":"Zestawienie!S8","v":"Zadanie 5"},{"$f":"Zestawienie!T8","v":0},{"$nulls":3},{"$f":"Zestawienie!W8","v":"Zadanie 6"},{"$f":"Zestawienie!X8","v":0},{"$nulls":3},{"$f":"Zestawienie!AA8","v":"Zadanie 7"},{"$f":"Zestawienie!AB8","v":0},{"$nulls":3},{"$f":"Zestawienie!AE8","v":"Zadanie 8"},{"$f":"Zestawienie!AF8","v":0},{"$nulls":3},{"$f":"Zestawienie!AI8","v":"Zadanie 9"},{"$f":"Zestawienie!AJ8","v":0}]
[{"$f":"Zestawienie!A9","v":0},0,{"$f":"Zestawienie!C9","v":"Cena -  50%"},{"$f":"Zestawienie!D9","v":"Doświadczenie trenera w realizacji szkolen/warsztetów interpersonalnych ( w godzinach) 40%"},{"$f":"Zestawienie!E9","v":"Termin przeprowadzenia I Warsztatu  (w dniach) 10%"},{"$f":"Zestawienie!F9","v":" %"},"Razem",{"$f":"Zestawienie!G9","v":"Cena -  60%"},{"$f":"Zestawienie!H9","v":" %"},{"$f":"Zestawienie!I9","v":" %"},{"$f":"Zestawienie!J9","v":" %"},"Razem",{"$f":"Zestawienie!K9","v":"Cena -  60%"},{"$f":"Zestawienie!L9","v":" %"},{"$f":"Zestawienie!M9","v":" %"},{"$f":"Zestawienie!N9","v":" %"},"Razem",{"$f":"Zestawienie!O9","v":"Cena -  60%"},{"$f":"Zestawienie!P9","v":" %"},{"$f":"Zestawienie!Q9","v":" %"},{"$f":"Zestawienie!R9","v":" %"},"Razem",{"$f":"Zestawienie!S9","v":"Cena -  60%"},{"$f":"Zestawienie!T9","v":" %"},{"$f":"Zestawienie!U9","v":" %"},{"$f":"Zestawienie!V9","v":" %"},"Razem",{"$f":"Zestawienie!W9","v":"Cena -  60%"},{"$f":"Zestawienie!X9","v":" %"},{"$f":"Zestawienie!Y9","v":" %"},{"$f":"Zestawienie!Z9","v":" %"},"Razem",{"$f":"Zestawienie!AA9","v":"Cena -  60%"},{"$f":"Zestawienie!AB9","v":" %"},{"$f":"Zestawienie!AC9","v":" %"},{"$f":"Zestawienie!AD9","v":" %"},"Razem",{"$f":"Zestawienie!AE9","v":"Cena -  60%"},{"$f":"Zestawienie!AF9","v":" %"},{"$f":"Zestawienie!AG9","v":" %"},{"$f":"Zestawienie!AH9","v":" %"},"Razem",{"$f":"Zestawienie!AI9","v":"Cena -  60%"},{"$f":"Zestawienie!AJ9","v":"Okres gwarancji (w miesiącach) - %"},{"$f":"Zestawienie!AK9","v":"Termin płatności (w dniach) -  %"},{"$f":"Zestawienie!AL9","v":" %"},"Razem"]
[{"$f":"Zestawienie!A10","v":1},{"$f":"Dane!D3","v":"Nowoczesny Osrodek Edukacji Anna Ratuszniak"},{"$f":"IF(Zestawienie!C10>0,Zestawienie!C10,\"ZERO\")","v":30000},{"$f":"IF(Zestawienie!D10>0,Zestawienie!D10,\"ZERO\")","v":4256},{"$f":"IF(Zestawienie!E10>0,Zestawienie!E10,\"ZERO\")","v":1},{"$f":"IF(Zestawienie!F10>0,Zestawienie!F10,\"ZERO\")","v":"ZERO"},null,{"$f":"IF(Zestawienie!G10>0,Zestawienie!G10,\"ZERO\")","v":"ZERO"},{"$f":"IF(Zestawienie!H10>0,Zestawienie!H10,\"ZERO\")","v":"ZERO"},{"$f":"IF(Zestawienie!I10>0,Zestawienie!I10,\"ZERO\")","v":"ZERO"},{"$f":"IF(Zestawienie!J10>0,Zestawienie!J10,\"ZERO\")","v":"ZERO"},null,{"$f":"IF(Zestawienie!K10>0,Zestawienie!K10,\"ZERO\")","v":"ZERO"},{"$f":"IF(Zestawienie!L10>0,Zestawienie!L10,\"ZERO\")","v":"ZERO"},{"$f":"IF(Zestawienie!M10>0,Zestawienie!M10,\"ZERO\")","v":"ZERO"},{"$f":"IF(Zestawienie!N10>0,Zestawienie!N10,\"ZERO\")","v":"ZERO"},null,{"$f":"IF(Zestawienie!O10>0,Zestawienie!O10,\"ZERO\")","v":"ZERO"},{"$f":"IF(Zestawienie!P10>0,Zestawienie!P10,\"ZERO\")","v":"ZERO"},{"$f":"IF(Zestawienie!Q10>0,Zestawienie!Q10,\"ZERO\")","v":"ZERO"},{"$f":"IF(Zestawienie!R10>0,Zestawienie!R10,\"ZERO\")","v":"ZERO"},null,{"$f":"IF(Zestawienie!S10>0,Zestawienie!S10,\"ZERO\")","v":"ZERO"},{"$f":"IF(Zestawienie!T10>0,Zestawienie!T10,\"ZERO\")","v":"ZERO"},{"$f":"IF(Zestawienie!U10>0,Zestawienie!U10,\"ZERO\")","v":"ZERO"},{"$f":"IF(Zestawienie!V10>0,Zestawienie!V10,\"ZERO\")","v":"ZERO"},null,{"$f":"IF(Zestawienie!W10>0,Zestawienie!W10,\"ZERO\")","v":"ZERO"},{"$f":"IF(Zestawienie!X10>0,Zestawienie!X10,\"ZERO\")","v":"ZERO"},{"$f":"IF(Zestawienie!Y10>0,Zestawienie!Y10,\"ZERO\")","v":"ZERO"},{"$f":"IF(Zestawienie!Z10>0,Zestawienie!Z10,\"ZERO\")","v":"ZERO"},null,{"$f":"IF(Zestawienie!AA10>0,Zestawienie!AA10,\"ZERO\")","v":"ZERO"},{"$f":"IF(Zestawienie!AB10>0,Zestawienie!AB10,\"ZERO\")","v":"ZERO"},{"$f":"IF(Zestawienie!AC10>0,Zestawienie!AC10,\"ZERO\")","v":"ZERO"},{"$f":"IF(Zestawienie!AD10>0,Zestawienie!AD10,\"ZERO\")","v":"ZERO"},null,{"$f":"IF(Zestawienie!AE10>0,Zestawienie!AE10,\"ZERO\")","v":"ZERO"},{"$f":"IF(Zestawienie!AF10>0,Zestawienie!AF10,\"ZERO\")","v":"ZERO"},{"$f":"IF(Zestawienie!AG10>0,Zestawienie!AG10,\"ZERO\")","v":"ZERO"},{"$f":"IF(Zestawienie!AH10>0,Zestawienie!AH10,\"ZERO\")","v":"ZERO"},null,{"$f":"IF(Zestawienie!AI10>0,Zestawienie!AI10,\"ZERO\")","v":"ZERO"},{"$f":"IF(Zestawienie!AJ10>0,Zestawienie!AJ10,\"ZERO\")","v":"ZERO"},{"$f":"IF(Zestawienie!AK10>0,Zestawienie!AK10,\"ZERO\")","v":"ZERO"},{"$f":"IF(Zestawienie!AL10>0,Zestawienie!AL10,\"ZERO\")","v":"ZERO"}]
[{"$f":"Zestawienie!A11","v":2},{"$f":"Dane!D4","v":"Agencja Analiz i Doradztwa Personalnego Remigiusz Koc"},{"$f":"IF(Zestawienie!C11>0,Zestawienie!C11,\"ZERO\")","v":16728},{"$f":"IF(Zestawienie!D11>0,Zestawienie!D11,\"ZERO\")","v":1471},{"$f":"IF(Zestawienie!E11>0,Zestawienie!E11,\"ZERO\")","v":1},{"$f":"IF(Zestawienie!F11>0,Zestawienie!F11,\"ZERO\")","v":"ZERO"},null,{"$f":"IF(Zestawienie!G11>0,Zestawienie!G11,\"ZERO\")","v":"ZERO"},{"$f":"IF(Zestawienie!H11>0,Zestawienie!H11,\"ZERO\")","v":"ZERO"},{"$f":"IF(Zestawienie!I11>0,Zestawienie!I11,\"ZERO\")","v":"ZERO"},{"$f":"IF(Zestawienie!J11>0,Zestawienie!J11,\"ZERO\")","v":"ZERO"},null,{"$f":"IF(Zestawienie!K11>0,Zestawienie!K11,\"ZERO\")","v":"ZERO"},{"$f":"IF(Zestawienie!L11>0,Zestawienie!L11,\"ZERO\")","v":"ZERO"},{"$f":"IF(Zestawienie!M11>0,Zestawienie!M11,\"ZERO\")","v":"ZERO"},{"$f":"IF(Zestawienie!N11>0,Zestawienie!N11,\"ZERO\")","v":"ZERO"},null,{"$f":"IF(Zestawienie!O11>0,Zestawienie!O11,\"ZERO\")","v":"ZERO"},{"$f":"IF(Zestawienie!P11>0,Zestawienie!P11,\"ZERO\")","v":"ZERO"},{"$f":"IF(Zestawienie!Q11>0,Zestawienie!Q11,\"ZERO\")","v":"ZERO"},{"$f":"IF(Zestawienie!R11>0,Zestawienie!R11,\"ZERO\")","v":"ZERO"},null,{"$f":"IF(Zestawienie!S11>0,Zestawienie!S11,\"ZERO\")","v":"ZERO"},{"$f":"IF(Zestawienie!T11>0,Zestawienie!T11,\"ZERO\")","v":"ZERO"},{"$f":"IF(Zestawienie!U11>0,Zestawienie!U11,\"ZERO\")","v":"ZERO"},{"$f":"IF(Zestawienie!V11>0,Zestawienie!V11,\"ZERO\")","v":"ZERO"},null,{"$f":"IF(Zestawienie!W11>0,Zestawienie!W11,\"ZERO\")","v":"ZERO"},{"$f":"IF(Zestawienie!X11>0,Zestawienie!X11,\"ZERO\")","v":"ZERO"},{"$f":"IF(Zestawienie!Y11>0,Zestawienie!Y11,\"ZERO\")","v":"ZERO"},{"$f":"IF(Zestawienie!Z11>0,Zestawienie!Z11,\"ZERO\")","v":"ZERO"},null,{"$f":"IF(Zestawienie!AA11>0,Zestawienie!AA11,\"ZERO\")","v":"ZERO"},{"$f":"IF(Zestawienie!AB11>0,Zestawienie!AB11,\"ZERO\")","v":"ZERO"},{"$f":"IF(Zestawienie!AC11>0,Zestawienie!AC11,\"ZERO\")","v":"ZERO"},{"$f":"IF(Zestawienie!AD11>0,Zestawienie!AD11,\"ZERO\")","v":"ZERO"},null,{"$f":"IF(Zestawienie!AE11>0,Zestawienie!AE11,\"ZERO\")","v":"ZERO"},{"$f":"IF(Zestawienie!AF11>0,Zestawienie!AF11,\"ZERO\")","v":"ZERO"},{"$f":"IF(Zestawienie!AG11>0,Zestawienie!AG11,\"ZERO\")","v":"ZERO"},{"$f":"IF(Zestawienie!AH11>0,Zestawienie!AH11,\"ZERO\")","v":"ZERO"},null,{"$f":"IF(Zestawienie!AI11>0,Zestawienie!AI11,\"ZERO\")","v":"ZERO"},{"$f":"IF(Zestawienie!AJ11>0,Zestawienie!AJ11,\"ZERO\")","v":"ZERO"},{"$f":"IF(Zestawienie!AK11>0,Zestawienie!AK11,\"ZERO\")","v":"ZERO"},{"$f":"IF(Zestawienie!AL11>0,Zestawienie!AL11,\"ZERO\")","v":"ZERO"}]
[{"$f":"Zestawienie!A12","v":3},{"$f":"Dane!D5","v":"IMMOQEE Sp. z o.o."},{"$f":"IF(Zestawienie!C12>0,Zestawienie!C12,\"ZERO\")","v":19500},{"$f":"IF(Zestawienie!D12>0,Zestawienie!D12,\"ZERO\")","v":600},{"$f":"IF(Zestawienie!E12>0,Zestawienie!E12,\"ZERO\")","v":3},{"$f":"IF(Zestawienie!F12>0,Zestawienie!F12,\"ZERO\")","v":"ZERO"},null,{"$f":"IF(Zestawienie!G12>0,Zestawienie!G12,\"ZERO\")","v":"ZERO"},{"$f":"IF(Zestawienie!H12>0,Zestawienie!H12,\"ZERO\")","v":"ZERO"},{"$f":"IF(Zestawienie!I12>0,Zestawienie!I12,\"ZERO\")","v":"ZERO"},{"$f":"IF(Zestawienie!J12>0,Zestawienie!J12,\"ZERO\")","v":"ZERO"},null,{"$f":"IF(Zestawienie!K12>0,Zestawienie!K12,\"ZERO\")","v":"ZERO"},{"$f":"IF(Zestawienie!L12>0,Zestawienie!L12,\"ZERO\")","v":"ZERO"},{"$f":"IF(Zestawienie!M12>0,Zestawienie!M12,\"ZERO\")","v":"ZERO"},{"$f":"IF(Zestawienie!N12>0,Zestawienie!N12,\"ZERO\")","v":"ZERO"},null,{"$f":"IF(Zestawienie!O12>0,Zestawienie!O12,\"ZERO\")","v":"ZERO"},{"$f":"IF(Zestawienie!P12>0,Zestawienie!P12,\"ZERO\")","v":"ZERO"},{"$f":"IF(Zestawienie!Q12>0,Zestawienie!Q12,\"ZERO\")","v":"ZERO"},{"$f":"IF(Zestawienie!R12>0,Zestawienie!R12,\"ZERO\")","v":"ZERO"},null,{"$f":"IF(Zestawienie!S12>0,Zestawienie!S12,\"ZERO\")","v":"ZERO"},{"$f":"IF(Zestawienie!T12>0,Zestawienie!T12,\"ZERO\")","v":"ZERO"},{"$f":"IF(Zestawienie!U12>0,Zestawienie!U12,\"ZERO\")","v":"ZERO"},{"$f":"IF(Zestawienie!V12>0,Zestawienie!V12,\"ZERO\")","v":"ZERO"},null,{"$f":"IF(Zestawienie!W12>0,Zestawienie!W12,\"ZERO\")","v":"ZERO"},{"$f":"IF(Zestawienie!X12>0,Zestawienie!X12,\"ZERO\")","v":"ZERO"},{"$f":"IF(Zestawienie!Y12>0,Zestawienie!Y12,\"ZERO\")","v":"ZERO"},{"$f":"IF(Zestawienie!Z12>0,Zestawienie!Z12,\"ZERO\")","v":"ZERO"},null,{"$f":"IF(Zestawienie!AA12>0,Zestawienie!AA12,\"ZERO\")","v":"ZERO"},{"$f":"IF(Zestawienie!AB12>0,Zestawienie!AB12,\"ZERO\")","v":"ZERO"},{"$f":"IF(Zestawienie!AC12>0,Zestawienie!AC12,\"ZERO\")","v":"ZERO"},{"$f":"IF(Zestawienie!AD12>0,Zestawienie!AD12,\"ZERO\")","v":"ZERO"},null,{"$f":"IF(Zestawienie!AE12>0,Zestawienie!AE12,\"ZERO\")","v":"ZERO"},{"$f":"IF(Zestawienie!AF12>0,Zestawienie!AF12,\"ZERO\")","v":"ZERO"},{"$f":"IF(Zestawienie!AG12>0,Zestawienie!AG12,\"ZERO\")","v":"ZERO"},{"$f":"IF(Zestawienie!AH12>0,Zestawienie!AH12,\"ZERO\")","v":"ZERO"},null,{"$f":"IF(Zestawienie!AI12>0,Zestawienie!AI12,\"ZERO\")","v":"ZERO"},{"$f":"IF(Zestawienie!AJ12>0,Zestawienie!AJ12,\"ZERO\")","v":"ZERO"},{"$f":"IF(Zestawienie!AK12>0,Zestawienie!AK12,\"ZERO\")","v":"ZERO"},{"$f":"IF(Zestawienie!AL12>0,Zestawienie!AL12,\"ZERO\")","v":"ZERO"}]
[{"$f":"Zestawienie!A13","v":4},{"$f":"Dane!D6","v":"Brainstorm Group Sp. z o.o. "},{"$f":"IF(Zestawienie!C13>0,Zestawienie!C13,\"ZERO\")","v":73800},{"$f":"IF(Zestawienie!D13>0,Zestawienie!D13,\"ZERO\")","v":1916},{"$f":"IF(Zestawienie!E13>0,Zestawienie!E13,\"ZERO\")","v":1},{"$f":"IF(Zestawienie!F13>0,Zestawienie!F13,\"ZERO\")","v":"ZERO"},null,{"$f":"IF(Zestawienie!G13>0,Zestawienie!G13,\"ZERO\")","v":"ZERO"},{"$f":"IF(Zestawienie!H13>0,Zestawienie!H13,\"ZERO\")","v":"ZERO"},{"$f":"IF(Zestawienie!I13>0,Zestawienie!I13,\"ZERO\")","v":"ZERO"},{"$f":"IF(Zestawienie!J13>0,Zestawienie!J13,\"ZERO\")","v":"ZERO"},null,{"$f":"IF(Zestawienie!K13>0,Zestawienie!K13,\"ZERO\")","v":"ZERO"},{"$f":"IF(Zestawienie!L13>0,Zestawienie!L13,\"ZERO\")","v":"ZERO"},{"$f":"IF(Zestawienie!M13>0,Zestawienie!M13,\"ZERO\")","v":"ZERO"},{"$f":"IF(Zestawienie!N13>0,Zestawienie!N13,\"ZERO\")","v":"ZERO"},null,{"$f":"IF(Zestawienie!O13>0,Zestawienie!O13,\"ZERO\")","v":"ZERO"},{"$f":"IF(Zestawienie!P13>0,Zestawienie!P13,\"ZERO\")","v":"ZERO"},{"$f":"IF(Zestawienie!Q13>0,Zestawienie!Q13,\"ZERO\")","v":"ZERO"},{"$f":"IF(Zestawienie!R13>0,Zestawienie!R13,\"ZERO\")","v":"ZERO"},null,{"$f":"IF(Zestawienie!S13>0,Zestawienie!S13,\"ZERO\")","v":"ZERO"},{"$f":"IF(Zestawienie!T13>0,Zestawienie!T13,\"ZERO\")","v":"ZERO"},{"$f":"IF(Zestawienie!U13>0,Zestawienie!U13,\"ZERO\")","v":"ZERO"},{"$f":"IF(Zestawienie!V13>0,Zestawienie!V13,\"ZERO\")","v":"ZERO"},null,{"$f":"IF(Zestawienie!W13>0,Zestawienie!W13,\"ZERO\")","v":"ZERO"},{"$f":"IF(Zestawienie!X13>0,Zestawienie!X13,\"ZERO\")","v":"ZERO"},{"$f":"IF(Zestawienie!Y13>0,Zestawienie!Y13,\"ZERO\")","v":"ZERO"},{"$f":"IF(Zestawienie!Z13>0,Zestawienie!Z13,\"ZERO\")","v":"ZERO"},null,{"$f":"IF(Zestawienie!AA13>0,Zestawienie!AA13,\"ZERO\")","v":"ZERO"},{"$f":"IF(Zestawienie!AB13>0,Zestawienie!AB13,\"ZERO\")","v":"ZERO"},{"$f":"IF(Zestawienie!AC13>0,Zestawienie!AC13,\"ZERO\")","v":"ZERO"},{"$f":"IF(Zestawienie!AD13>0,Zestawienie!AD13,\"ZERO\")","v":"ZERO"},null,{"$f":"IF(Zestawienie!AE13>0,Zestawienie!AE13,\"ZERO\")","v":"ZERO"},{"$f":"IF(Zestawienie!AF13>0,Zestawienie!AF13,\"ZERO\")","v":"ZERO"},{"$f":"IF(Zestawienie!AG13>0,Zestawienie!AG13,\"ZERO\")","v":"ZERO"},{"$f":"IF(Zestawienie!AH13>0,Zestawienie!AH13,\"ZERO\")","v":"ZERO"},null,{"$f":"IF(Zestawienie!AI13>0,Zestawienie!AI13,\"ZERO\")","v":"ZERO"},{"$f":"IF(Zestawienie!AJ13>0,Zestawienie!AJ13,\"ZERO\")","v":"ZERO"},{"$f":"IF(Zestawienie!AK13>0,Zestawienie!AK13,\"ZERO\")","v":"ZERO"},{"$f":"IF(Zestawienie!AL13>0,Zestawienie!AL13,\"ZERO\")","v":"ZERO"}]
[{"$f":"Zestawienie!A14","v":5},{"$f":"Dane!D7","v":"Slow Life&Business"},{"$f":"IF(Zestawienie!C14>0,Zestawienie!C14,\"ZERO\")","v":"warsztat jednodniowy 1000,00zł netto, warsztat dwudniowy 1800,00zł"},{"$f":"IF(Zestawienie!D14>0,Zestawienie!D14,\"ZERO\")","v":570},{"$f":"IF(Zestawienie!E14>0,Zestawienie!E14,\"ZERO\")","v":"między 10 a 16 lipca br."},{"$f":"IF(Zestawienie!F14>0,Zestawienie!F14,\"ZERO\")","v":"ZERO"},null,{"$f":"IF(Zestawienie!G14>0,Zestawienie!G14,\"ZERO\")","v":"ZERO"},{"$f":"IF(Zestawienie!H14>0,Zestawienie!H14,\"ZERO\")","v":"ZERO"},{"$f":"IF(Zestawienie!I14>0,Zestawienie!I14,\"ZERO\")","v":"ZERO"},{"$f":"IF(Zestawienie!J14>0,Zestawienie!J14,\"ZERO\")","v":"ZERO"},null,{"$f":"IF(Zestawienie!K14>0,Zestawienie!K14,\"ZERO\")","v":"ZERO"},{"$f":"IF(Zestawienie!L14>0,Zestawienie!L14,\"ZERO\")","v":"ZERO"},{"$f":"IF(Zestawienie!M14>0,Zestawienie!M14,\"ZERO\")","v":"ZERO"},{"$f":"IF(Zestawienie!N14>0,Zestawienie!N14,\"ZERO\")","v":"ZERO"},null,{"$f":"IF(Zestawienie!O14>0,Zestawienie!O14,\"ZERO\")","v":"ZERO"},{"$f":"IF(Zestawienie!P14>0,Zestawienie!P14,\"ZERO\")","v":"ZERO"},{"$f":"IF(Zestawienie!Q14>0,Zestawienie!Q14,\"ZERO\")","v":"ZERO"},{"$f":"IF(Zestawienie!R14>0,Zestawienie!R14,\"ZERO\")","v":"ZERO"},null,{"$f":"IF(Zestawienie!S14>0,Zestawienie!S14,\"ZERO\")","v":"ZERO"},{"$f":"IF(Zestawienie!T14>0,Zestawienie!T14,\"ZERO\")","v":"ZERO"},{"$f":"IF(Zestawienie!U14>0,Zestawienie!U14,\"ZERO\")","v":"ZERO"},{"$f":"IF(Zestawienie!V14>0,Zestawienie!V14,\"ZERO\")","v":"ZERO"},null,{"$f":"IF(Zestawienie!W14>0,Zestawienie!W14,\"ZERO\")","v":"ZERO"},{"$f":"IF(Zestawienie!X14>0,Zestawienie!X14,\"ZERO\")","v":"ZERO"},{"$f":"IF(Zestawienie!Y14>0,Zestawienie!Y14,\"ZERO\")","v":"ZERO"},{"$f":"IF(Zestawienie!Z14>0,Zestawienie!Z14,\"ZERO\")","v":"ZERO"},null,{"$f":"IF(Zestawienie!AA14>0,Zestawienie!AA14,\"ZERO\")","v":"ZERO"},{"$f":"IF(Zestawienie!AB14>0,Zestawienie!AB14,\"ZERO\")","v":"ZERO"},{"$f":"IF(Zestawienie!AC14>0,Zestawienie!AC14,\"ZERO\")","v":"ZERO"},{"$f":"IF(Zestawienie!AD14>0,Zestawienie!AD14,\"ZERO\")","v":"ZERO"},null,{"$f":"IF(Zestawienie!AE14>0,Zestawienie!AE14,\"ZERO\")","v":"ZERO"},{"$f":"IF(Zestawienie!AF14>0,Zestawienie!AF14,\"ZERO\")","v":"ZERO"},{"$f":"IF(Zestawienie!AG14>0,Zestawienie!AG14,\"ZERO\")","v":"ZERO"},{"$f":"IF(Zestawienie!AH14>0,Zestawienie!AH14,\"ZERO\")","v":"ZERO"},null,{"$f":"IF(Zestawienie!AI14>0,Zestawienie!AI14,\"ZERO\")","v":"ZERO"},{"$f":"IF(Zestawienie!AJ14>0,Zestawienie!AJ14,\"ZERO\")","v":"ZERO"},{"$f":"IF(Zestawienie!AK14>0,Zestawienie!AK14,\"ZERO\")","v":"ZERO"},{"$f":"IF(Zestawienie!AL14>0,Zestawienie!AL14,\"ZERO\")","v":"ZERO"}]
[{"$f":"Zestawienie!A15","v":6},{"$f":"Dane!D8","v":"RAJOS COSULTING Rafał Stelmasik"},{"$f":"IF(Zestawienie!C15>0,Zestawienie!C15,\"ZERO\")","v":10880},{"$f":"IF(Zestawienie!D15>0,Zestawienie!D15,\"ZERO\")","v":300},{"$f":"IF(Zestawienie!E15>0,Zestawienie!E15,\"ZERO\")","v":3},{"$f":"IF(Zestawienie!F15>0,Zestawienie!F15,\"ZERO\")","v":"ZERO"},null,{"$f":"IF(Zestawienie!G15>0,Zestawienie!G15,\"ZERO\")","v":"ZERO"},{"$f":"IF(Zestawienie!H15>0,Zestawienie!H15,\"ZERO\")","v":"ZERO"},{"$f":"IF(Zestawienie!I15>0,Zestawienie!I15,\"ZERO\")","v":"ZERO"},{"$f":"IF(Zestawienie!J15>0,Zestawienie!J15,\"ZERO\")","v":"ZERO"},null,{"$f":"IF(Zestawienie!K15>0,Zestawienie!K15,\"ZERO\")","v":"ZERO"},{"$f":"IF(Zestawienie!L15>0,Zestawienie!L15,\"ZERO\")","v":"ZERO"},{"$f":"IF(Zestawienie!M15>0,Zestawienie!M15,\"ZERO\")","v":"ZERO"},{"$f":"IF(Zestawienie!N15>0,Zestawienie!N15,\"ZERO\")","v":"ZERO"},null,{"$f":"IF(Zestawienie!O15>0,Zestawienie!O15,\"ZERO\")","v":"ZERO"},{"$f":"IF(Zestawienie!P15>0,Zestawienie!P15,\"ZERO\")","v":"ZERO"},{"$f":"IF(Zestawienie!Q15>0,Zestawienie!Q15,\"ZERO\")","v":"ZERO"},{"$f":"IF(Zestawienie!R15>0,Zestawienie!R15,\"ZERO\")","v":"ZERO"},null,{"$f":"IF(Zestawienie!S15>0,Zestawienie!S15,\"ZERO\")","v":"ZERO"},{"$f":"IF(Zestawienie!T15>0,Zestawienie!T15,\"ZERO\")","v":"ZERO"},{"$f":"IF(Zestawienie!U15>0,Zestawienie!U15,\"ZERO\")","v":"ZERO"},{"$f":"IF(Zestawienie!V15>0,Zestawienie!V15,\"ZERO\")","v":"ZERO"},null,{"$f":"IF(Zestawienie!W15>0,Zestawienie!W15,\"ZERO\")","v":"ZERO"},{"$f":"IF(Zestawienie!X15>0,Zestawienie!X15,\"ZERO\")","v":"ZERO"},{"$f":"IF(Zestawienie!Y15>0,Zestawienie!Y15,\"ZERO\")","v":"ZERO"},{"$f":"IF(Zestawienie!Z15>0,Zestawienie!Z15,\"ZERO\")","v":"ZERO"},null,{"$f":"IF(Zestawienie!AA15>0,Zestawienie!AA15,\"ZERO\")","v":"ZERO"},{"$f":"IF(Zestawienie!AB15>0,Zestawienie!AB15,\"ZERO\")","v":"ZERO"},{"$f":"IF(Zestawienie!AC15>0,Zestawienie!AC15,\"ZERO\")","v":"ZERO"},{"$f":"IF(Zestawienie!AD15>0,Zestawienie!AD15,\"ZERO\")","v":"ZERO"},null,{"$f":"IF(Zestawienie!AE15>0,Zestawienie!AE15,\"ZERO\")","v":"ZERO"},{"$f":"IF(Zestawienie!AF15>0,Zestawienie!AF15,\"ZERO\")","v":"ZERO"},{"$f":"IF(Zestawienie!AG15>0,Zestawienie!AG15,\"ZERO\")","v":"ZERO"},{"$f":"IF(Zestawienie!AH15>0,Zestawienie!AH15,\"ZERO\")","v":"ZERO"},null,{"$f":"IF(Zestawienie!AI15>0,Zestawienie!AI15,\"ZERO\")","v":"ZERO"},{"$f":"IF(Zestawienie!AJ15>0,Zestawienie!AJ15,\"ZERO\")","v":"ZERO"},{"$f":"IF(Zestawienie!AK15>0,Zestawienie!AK15,\"ZERO\")","v":"ZERO"},{"$f":"IF(Zestawienie!AL15>0,Zestawienie!AL15,\"ZERO\")","v":"ZERO"}]
[{"$f":"Zestawienie!A16","v":7},{"$f":"Dane!D9","v":"Centrum Szkoleń Wielozawodowych DELTA"},{"$f":"IF(Zestawienie!C16>0,Zestawienie!C16,\"ZERO\")","v":10055},{"$f":"IF(Zestawienie!D16>0,Zestawienie!D16,\"ZERO\")","v":300},{"$f":"IF(Zestawienie!E16>0,Zestawienie!E16,\"ZERO\")","v":2},{"$f":"IF(Zestawienie!F16>0,Zestawienie!F16,\"ZERO\")","v":"ZERO"},null,{"$f":"IF(Zestawienie!G16>0,Zestawienie!G16,\"ZERO\")","v":"ZERO"},{"$f":"IF(Zestawienie!H16>0,Zestawienie!H16,\"ZERO\")","v":"ZERO"},{"$f":"IF(Zestawienie!I16>0,Zestawienie!I16,\"ZERO\")","v":"ZERO"},{"$f":"IF(Zestawienie!J16>0,Zestawienie!J16,\"ZERO\")","v":"ZERO"},null,{"$f":"IF(Zestawienie!K16>0,Zestawienie!K16,\"ZERO\")","v":"ZERO"},{"$f":"IF(Zestawienie!L16>0,Zestawienie!L16,\"ZERO\")","v":"ZERO"},{"$f":"IF(Zestawienie!M16>0,Zestawienie!M16,\"ZERO\")","v":"ZERO"},{"$f":"IF(Zestawienie!N16>0,Zestawienie!N16,\"ZERO\")","v":"ZERO"},null,{"$f":"IF(Zestawienie!O16>0,Zestawienie!O16,\"ZERO\")","v":"ZERO"},{"$f":"IF(Zestawienie!P16>0,Zestawienie!P16,\"ZERO\")","v":"ZERO"},{"$f":"IF(Zestawienie!Q16>0,Zestawienie!Q16,\"ZERO\")","v":"ZERO"},{"$f":"IF(Zestawienie!R16>0,Zestawienie!R16,\"ZERO\")","v":"ZERO"},null,{"$f":"IF(Zestawienie!S16>0,Zestawienie!S16,\"ZERO\")","v":"ZERO"},{"$f":"IF(Zestawienie!T16>0,Zestawienie!T16,\"ZERO\")","v":"ZERO"},{"$f":"IF(Zestawienie!U16>0,Zestawienie!U16,\"ZERO\")","v":"ZERO"},{"$f":"IF(Zestawienie!V16>0,Zestawienie!V16,\"ZERO\")","v":"ZERO"},null,{"$f":"IF(Zestawienie!W16>0,Zestawienie!W16,\"ZERO\")","v":"ZERO"},{"$f":"IF(Zestawienie!X16>0,Zestawienie!X16,\"ZERO\")","v":"ZERO"},{"$f":"IF(Zestawienie!Y16>0,Zestawienie!Y16,\"ZERO\")","v":"ZERO"},{"$f":"IF(Zestawienie!Z16>0,Zestawienie!Z16,\"ZERO\")","v":"ZERO"},null,{"$f":"IF(Zestawienie!AA16>0,Zestawienie!AA16,\"ZERO\")","v":"ZERO"},{"$f":"IF(Zestawienie!AB16>0,Zestawienie!AB16,\"ZERO\")","v":"ZERO"},{"$f":"IF(Zestawienie!AC16>0,Zestawienie!AC16,\"ZERO\")","v":"ZERO"},{"$f":"IF(Zestawienie!AD16>0,Zestawienie!AD16,\"ZERO\")","v":"ZERO"},null,{"$f":"IF(Zestawienie!AE16>0,Zestawienie!AE16,\"ZERO\")","v":"ZERO"},{"$f":"IF(Zestawienie!AF16>0,Zestawienie!AF16,\"ZERO\")","v":"ZERO"},{"$f":"IF(Zestawienie!AG16>0,Zestawienie!AG16,\"ZERO\")","v":"ZERO"},{"$f":"IF(Zestawienie!AH16>0,Zestawienie!AH16,\"ZERO\")","v":"ZERO"},null,{"$f":"IF(Zestawienie!AI16>0,Zestawienie!AI16,\"ZERO\")","v":"ZERO"},{"$f":"IF(Zestawienie!AJ16>0,Zestawienie!AJ16,\"ZERO\")","v":"ZERO"},{"$f":"IF(Zestawienie!AK16>0,Zestawienie!AK16,\"ZERO\")","v":"ZERO"},{"$f":"IF(Zestawienie!AL16>0,Zestawienie!AL16,\"ZERO\")","v":"ZERO"}]
[{"$f":"Zestawienie!A17","v":8},{"$f":"Dane!D10","v":"Coach and Go Joanna Chorwacka"},{"$f":"IF(Zestawienie!C17>0,Zestawienie!C17,\"ZERO\")","v":16000},{"$f":"IF(Zestawienie!D17>0,Zestawienie!D17,\"ZERO\")","v":500},{"$f":"IF(Zestawienie!E17>0,Zestawienie!E17,\"ZERO\")","v":2},{"$f":"IF(Zestawienie!F17>0,Zestawienie!F17,\"ZERO\")","v":"ZERO"},null,{"$f":"IF(Zestawienie!G17>0,Zestawienie!G17,\"ZERO\")","v":"ZERO"},{"$f":"IF(Zestawienie!H17>0,Zestawienie!H17,\"ZERO\")","v":"ZERO"},{"$f":"IF(Zestawienie!I17>0,Zestawienie!I17,\"ZERO\")","v":"ZERO"},{"$f":"IF(Zestawienie!J17>0,Zestawienie!J17,\"ZERO\")","v":"ZERO"},null,{"$f":"IF(Zestawienie!K17>0,Zestawienie!K17,\"ZERO\")","v":"ZERO"},{"$f":"IF(Zestawienie!L17>0,Zestawienie!L17,\"ZERO\")","v":"ZERO"},{"$f":"IF(Zestawienie!M17>0,Zestawienie!M17,\"ZERO\")","v":"ZERO"},{"$f":"IF(Zestawienie!N17>0,Zestawienie!N17,\"ZERO\")","v":"ZERO"},null,{"$f":"IF(Zestawienie!O17>0,Zestawienie!O17,\"ZERO\")","v":"ZERO"},{"$f":"IF(Zestawienie!P17>0,Zestawienie!P17,\"ZERO\")","v":"ZERO"},{"$f":"IF(Zestawienie!Q17>0,Zestawienie!Q17,\"ZERO\")","v":"ZERO"},{"$f":"IF(Zestawienie!R17>0,Zestawienie!R17,\"ZERO\")","v":"ZERO"},null,{"$f":"IF(Zestawienie!S17>0,Zestawienie!S17,\"ZERO\")","v":"ZERO"},{"$f":"IF(Zestawienie!T17>0,Zestawienie!T17,\"ZERO\")","v":"ZERO"},{"$f":"IF(Zestawienie!U17>0,Zestawienie!U17,\"ZERO\")","v":"ZERO"},{"$f":"IF(Zestawienie!V17>0,Zestawienie!V17,\"ZERO\")","v":"ZERO"},null,{"$f":"IF(Zestawienie!W17>0,Zestawienie!W17,\"ZERO\")","v":"ZERO"},{"$f":"IF(Zestawienie!X17>0,Zestawienie!X17,\"ZERO\")","v":"ZERO"},{"$f":"IF(Zestawienie!Y17>0,Zestawienie!Y17,\"ZERO\")","v":"ZERO"},{"$f":"IF(Zestawienie!Z17>0,Zestawienie!Z17,\"ZERO\")","v":"ZERO"},null,{"$f":"IF(Zestawienie!AA17>0,Zestawienie!AA17,\"ZERO\")","v":"ZERO"},{"$f":"IF(Zestawienie!AB17>0,Zestawienie!AB17,\"ZERO\")","v":"ZERO"},{"$f":"IF(Zestawienie!AC17>0,Zestawienie!AC17,\"ZERO\")","v":"ZERO"},{"$f":"IF(Zestawienie!AD17>0,Zestawienie!AD17,\"ZERO\")","v":"ZERO"},null,{"$f":"IF(Zestawienie!AE17>0,Zestawienie!AE17,\"ZERO\")","v":"ZERO"},{"$f":"IF(Zestawienie!AF17>0,Zestawienie!AF17,\"ZERO\")","v":"ZERO"},{"$f":"IF(Zestawienie!AG17>0,Zestawienie!AG17,\"ZERO\")","v":"ZERO"},{"$f":"IF(Zestawienie!AH17>0,Zestawienie!AH17,\"ZERO\")","v":"ZERO"},null,{"$f":"IF(Zestawienie!AI17>0,Zestawienie!AI17,\"ZERO\")","v":"ZERO"},{"$f":"IF(Zestawienie!AJ17>0,Zestawienie!AJ17,\"ZERO\")","v":"ZERO"},{"$f":"IF(Zestawienie!AK17>0,Zestawienie!AK17,\"ZERO\")","v":"ZERO"},{"$f":"IF(Zestawienie!AL17>0,Zestawienie!AL17,\"ZERO\")","v":"ZERO"}]
[{"$f":"Zestawienie!A18","v":9},{"$f":"Dane!D11","v":"Moja Firma Elzbieta Kowalska"},{"$f":"IF(Zestawienie!C18>0,Zestawienie!C18,\"ZERO\")","v":32000},{"$f":"IF(Zestawienie!D18>0,Zestawienie!D18,\"ZERO\")","v":3038},{"$f":"IF(Zestawienie!E18>0,Zestawienie!E18,\"ZERO\")","v":1},{"$f":"IF(Zestawienie!F18>0,Zestawienie!F18,\"ZERO\")","v":"ZERO"},null,{"$f":"IF(Zestawienie!G18>0,Zestawienie!G18,\"ZERO\")","v":"ZERO"},{"$f":"IF(Zestawienie!H18>0,Zestawienie!H18,\"ZERO\")","v":"ZERO"},{"$f":"IF(Zestawienie!I18>0,Zestawienie!I18,\"ZERO\")","v":"ZERO"},{"$f":"IF(Zestawienie!J18>0,Zestawienie!J18,\"ZERO\")","v":"ZERO"},null,{"$f":"IF(Zestawienie!K18>0,Zestawienie!K18,\"ZERO\")","v":"ZERO"},{"$f":"IF(Zestawienie!L18>0,Zestawienie!L18,\"ZERO\")","v":"ZERO"},{"$f":"IF(Zestawienie!M18>0,Zestawienie!M18,\"ZERO\")","v":"ZERO"},{"$f":"IF(Zestawienie!N18>0,Zestawienie!N18,\"ZERO\")","v":"ZERO"},null,{"$f":"IF(Zestawienie!O18>0,Zestawienie!O18,\"ZERO\")","v":"ZERO"},{"$f":"IF(Zestawienie!P18>0,Zestawienie!P18,\"ZERO\")","v":"ZERO"},{"$f":"IF(Zestawienie!Q18>0,Zestawienie!Q18,\"ZERO\")","v":"ZERO"},{"$f":"IF(Zestawienie!R18>0,Zestawienie!R18,\"ZERO\")","v":"ZERO"},null,{"$f":"IF(Zestawienie!S18>0,Zestawienie!S18,\"ZERO\")","v":"ZERO"},{"$f":"IF(Zestawienie!T18>0,Zestawienie!T18,\"ZERO\")","v":"ZERO"},{"$f":"IF(Zestawienie!U18>0,Zestawienie!U18,\"ZERO\")","v":"ZERO"},{"$f":"IF(Zestawienie!V18>0,Zestawienie!V18,\"ZERO\")","v":"ZERO"},null,{"$f":"IF(Zestawienie!W18>0,Zestawienie!W18,\"ZERO\")","v":"ZERO"},{"$f":"IF(Zestawienie!X18>0,Zestawienie!X18,\"ZERO\")","v":"ZERO"},{"$f":"IF(Zestawienie!Y18>0,Zestawienie!Y18,\"ZERO\")","v":"ZERO"},{"$f":"IF(Zestawienie!Z18>0,Zestawienie!Z18,\"ZERO\")","v":"ZERO"},null,{"$f":"IF(Zestawienie!AA18>0,Zestawienie!AA18,\"ZERO\")","v":"ZERO"},{"$f":"IF(Zestawienie!AB18>0,Zestawienie!AB18,\"ZERO\")","v":"ZERO"},{"$f":"IF(Zestawienie!AC18>0,Zestawienie!AC18,\"ZERO\")","v":"ZERO"},{"$f":"IF(Zestawienie!AD18>0,Zestawienie!AD18,\"ZERO\")","v":"ZERO"},null,{"$f":"IF(Zestawienie!AE18>0,Zestawienie!AE18,\"ZERO\")","v":"ZERO"},{"$f":"IF(Zestawienie!AF18>0,Zestawienie!AF18,\"ZERO\")","v":"ZERO"},{"$f":"IF(Zestawienie!AG18>0,Zestawienie!AG18,\"ZERO\")","v":"ZERO"},{"$f":"IF(Zestawienie!AH18>0,Zestawienie!AH18,\"ZERO\")","v":"ZERO"},null,{"$f":"IF(Zestawienie!AI18>0,Zestawienie!AI18,\"ZERO\")","v":"ZERO"},{"$f":"IF(Zestawienie!AJ18>0,Zestawienie!AJ18,\"ZERO\")","v":"ZERO"},{"$f":"IF(Zestawienie!AK18>0,Zestawienie!AK18,\"ZERO\")","v":"ZERO"},{"$f":"IF(Zestawienie!AL18>0,Zestawienie!AL18,\"ZERO\")","v":"ZERO"}]
[{"$f":"Zestawienie!A19","v":10},{"$f":"Dane!D12","v":"LCE LOGOS Centrum Edukacyjne"},{"$f":"IF(Zestawienie!C19>0,Zestawienie!C19,\"ZERO\")","v":12160},{"$f":"IF(Zestawienie!D19>0,Zestawienie!D19,\"ZERO\")","v":922},{"$f":"IF(Zestawienie!E19>0,Zestawienie!E19,\"ZERO\")","v":1},{"$f":"IF(Zestawienie!F19>0,Zestawienie!F19,\"ZERO\")","v":"ZERO"},null,{"$f":"IF(Zestawienie!G19>0,Zestawienie!G19,\"ZERO\")","v":"ZERO"},{"$f":"IF(Zestawienie!H19>0,Zestawienie!H19,\"ZERO\")","v":"ZERO"},{"$f":"IF(Zestawienie!I19>0,Zestawienie!I19,\"ZERO\")","v":"ZERO"},{"$f":"IF(Zestawienie!J19>0,Zestawienie!J19,\"ZERO\")","v":"ZERO"},null,{"$f":"IF(Zestawienie!K19>0,Zestawienie!K19,\"ZERO\")","v":"ZERO"},{"$f":"IF(Zestawienie!L19>0,Zestawienie!L19,\"ZERO\")","v":"ZERO"},{"$f":"IF(Zestawienie!M19>0,Zestawienie!M19,\"ZERO\")","v":"ZERO"},{"$f":"IF(Zestawienie!N19>0,Zestawienie!N19,\"ZERO\")","v":"ZERO"},null,{"$f":"IF(Zestawienie!O19>0,Zestawienie!O19,\"ZERO\")","v":"ZERO"},{"$f":"IF(Zestawienie!P19>0,Zestawienie!P19,\"ZERO\")","v":"ZERO"},{"$f":"IF(Zestawienie!Q19>0,Zestawienie!Q19,\"ZERO\")","v":"ZERO"},{"$f":"IF(Zestawienie!R19>0,Zestawienie!R19,\"ZERO\")","v":"ZERO"},null,{"$f":"IF(Zestawienie!S19>0,Zestawienie!S19,\"ZERO\")","v":"ZERO"},{"$f":"IF(Zestawienie!T19>0,Zestawienie!T19,\"ZERO\")","v":"ZERO"},{"$f":"IF(Zestawienie!U19>0,Zestawienie!U19,\"ZERO\")","v":"ZERO"},{"$f":"IF(Zestawienie!V19>0,Zestawienie!V19,\"ZERO\")","v":"ZERO"},null,{"$f":"IF(Zestawienie!W19>0,Zestawienie!W19,\"ZERO\")","v":"ZERO"},{"$f":"IF(Zestawienie!X19>0,Zestawienie!X19,\"ZERO\")","v":"ZERO"},{"$f":"IF(Zestawienie!Y19>0,Zestawienie!Y19,\"ZERO\")","v":"ZERO"},{"$f":"IF(Zestawienie!Z19>0,Zestawienie!Z19,\"ZERO\")","v":"ZERO"},null,{"$f":"IF(Zestawienie!AA19>0,Zestawienie!AA19,\"ZERO\")","v":"ZERO"},{"$f":"IF(Zestawienie!AB19>0,Zestawienie!AB19,\"ZERO\")","v":"ZERO"},{"$f":"IF(Zestawienie!AC19>0,Zestawienie!AC19,\"ZERO\")","v":"ZERO"},{"$f":"IF(Zestawienie!AD19>0,Zestawienie!AD19,\"ZERO\")","v":"ZERO"},null,{"$f":"IF(Zestawienie!AE19>0,Zestawienie!AE19,\"ZERO\")","v":"ZERO"},{"$f":"IF(Zestawienie!AF19>0,Zestawienie!AF19,\"ZERO\")","v":"ZERO"},{"$f":"IF(Zestawienie!AG19>0,Zestawienie!AG19,\"ZERO\")","v":"ZERO"},{"$f":"IF(Zestawienie!AH19>0,Zestawienie!AH19,\"ZERO\")","v":"ZERO"},null,{"$f":"IF(Zestawienie!AI19>0,Zestawienie!AI19,\"ZERO\")","v":"ZERO"},{"$f":"IF(Zestawienie!AJ19>0,Zestawienie!AJ19,\"ZERO\")","v":"ZERO"},{"$f":"IF(Zestawienie!AK19>0,Zestawienie!AK19,\"ZERO\")","v":"ZERO"},{"$f":"IF(Zestawienie!AL19>0,Zestawienie!AL19,\"ZERO\")","v":"ZERO"}]
[{"$f":"Zestawienie!A20","v":11},{"$f":"Dane!D13","v":"SEKA S.A. "},{"$f":"IF(Zestawienie!C20>0,Zestawienie!C20,\"ZERO\")","v":17500},{"$f":"IF(Zestawienie!D20>0,Zestawienie!D20,\"ZERO\")","v":3054},{"$f":"IF(Zestawienie!E20>0,Zestawienie!E20,\"ZERO\")","v":1},{"$f":"IF(Zestawienie!F20>0,Zestawienie!F20,\"ZERO\")","v":"ZERO"},null,{"$f":"IF(Zestawienie!G20>0,Zestawienie!G20,\"ZERO\")","v":"ZERO"},{"$f":"IF(Zestawienie!H20>0,Zestawienie!H20,\"ZERO\")","v":"ZERO"},{"$f":"IF(Zestawienie!I20>0,Zestawienie!I20,\"ZERO\")","v":"ZERO"},{"$f":"IF(Zestawienie!J20>0,Zestawienie!J20,\"ZERO\")","v":"ZERO"},null,{"$f":"IF(Zestawienie!K20>0,Zestawienie!K20,\"ZERO\")","v":"ZERO"},{"$f":"IF(Zestawienie!L20>0,Zestawienie!L20,\"ZERO\")","v":"ZERO"},{"$f":"IF(Zestawienie!M20>0,Zestawienie!M20,\"ZERO\")","v":"ZERO"},{"$f":"IF(Zestawienie!N20>0,Zestawienie!N20,\"ZERO\")","v":"ZERO"},null,{"$f":"IF(Zestawienie!O20>0,Zestawienie!O20,\"ZERO\")","v":"ZERO"},{"$f":"IF(Zestawienie!P20>0,Zestawienie!P20,\"ZERO\")","v":"ZERO"},{"$f":"IF(Zestawienie!Q20>0,Zestawienie!Q20,\"ZERO\")","v":"ZERO"},{"$f":"IF(Zestawienie!R20>0,Zestawienie!R20,\"ZERO\")","v":"ZERO"},null,{"$f":"IF(Zestawienie!S20>0,Zestawienie!S20,\"ZERO\")","v":"ZERO"},{"$f":"IF(Zestawienie!T20>0,Zestawienie!T20,\"ZERO\")","v":"ZERO"},{"$f":"IF(Zestawienie!U20>0,Zestawienie!U20,\"ZERO\")","v":"ZERO"},{"$f":"IF(Zestawienie!V20>0,Zestawienie!V20,\"ZERO\")","v":"ZERO"},null,{"$f":"IF(Zestawienie!W20>0,Zestawienie!W20,\"ZERO\")","v":"ZERO"},{"$f":"IF(Zestawienie!X20>0,Zestawienie!X20,\"ZERO\")","v":"ZERO"},{"$f":"IF(Zestawienie!Y20>0,Zestawienie!Y20,\"ZERO\")","v":"ZERO"},{"$f":"IF(Zestawienie!Z20>0,Zestawienie!Z20,\"ZERO\")","v":"ZERO"},null,{"$f":"IF(Zestawienie!AA20>0,Zestawienie!AA20,\"ZERO\")","v":"ZERO"},{"$f":"IF(Zestawienie!AB20>0,Zestawienie!AB20,\"ZERO\")","v":"ZERO"},{"$f":"IF(Zestawienie!AC20>0,Zestawienie!AC20,\"ZERO\")","v":"ZERO"},{"$f":"IF(Zestawienie!AD20>0,Zestawienie!AD20,\"ZERO\")","v":"ZERO"},null,{"$f":"IF(Zestawienie!AE20>0,Zestawienie!AE20,\"ZERO\")","v":"ZERO"},{"$f":"IF(Zestawienie!AF20>0,Zestawienie!AF20,\"ZERO\")","v":"ZERO"},{"$f":"IF(Zestawienie!AG20>0,Zestawienie!AG20,\"ZERO\")","v":"ZERO"},{"$f":"IF(Zestawienie!AH20>0,Zestawienie!AH20,\"ZERO\")","v":"ZERO"},null,{"$f":"IF(Zestawienie!AI20>0,Zestawienie!AI20,\"ZERO\")","v":"ZERO"},{"$f":"IF(Zestawienie!AJ20>0,Zestawienie!AJ20,\"ZERO\")","v":"ZERO"},{"$f":"IF(Zestawienie!AK20>0,Zestawienie!AK20,\"ZERO\")","v":"ZERO"},{"$f":"IF(Zestawienie!AL20>0,Zestawienie!AL20,\"ZERO\")","v":"ZERO"}]
[{"$f":"Zestawienie!A21","v":12},{"$f":"Dane!D14","v":"Polska Akademia Oświaty Sp. z o.o."},{"$f":"IF(Zestawienie!C21>0,Zestawienie!C21,\"ZERO\")","v":32000},{"$f":"IF(Zestawienie!D21>0,Zestawienie!D21,\"ZERO\")","v":6058},{"$f":"IF(Zestawienie!E21>0,Zestawienie!E21,\"ZERO\")","v":1},{"$f":"IF(Zestawienie!F21>0,Zestawienie!F21,\"ZERO\")","v":"ZERO"},null,{"$f":"IF(Zestawienie!G21>0,Zestawienie!G21,\"ZERO\")","v":"ZERO"},{"$f":"IF(Zestawienie!H21>0,Zestawienie!H21,\"ZERO\")","v":"ZERO"},{"$f":"IF(Zestawienie!I21>0,Zestawienie!I21,\"ZERO\")","v":"ZERO"},{"$f":"IF(Zestawienie!J21>0,Zestawienie!J21,\"ZERO\")","v":"ZERO"},null,{"$f":"IF(Zestawienie!K21>0,Zestawienie!K21,\"ZERO\")","v":"ZERO"},{"$f":"IF(Zestawienie!L21>0,Zestawienie!L21,\"ZERO\")","v":"ZERO"},{"$f":"IF(Zestawienie!M21>0,Zestawienie!M21,\"ZERO\")","v":"ZERO"},{"$f":"IF(Zestawienie!N21>0,Zestawienie!N21,\"ZERO\")","v":"ZERO"},null,{"$f":"IF(Zestawienie!O21>0,Zestawienie!O21,\"ZERO\")","v":"ZERO"},{"$f":"IF(Zestawienie!P21>0,Zestawienie!P21,\"ZERO\")","v":"ZERO"},{"$f":"IF(Zestawienie!Q21>0,Zestawienie!Q21,\"ZERO\")","v":"ZERO"},{"$f":"IF(Zestawienie!R21>0,Zestawienie!R21,\"ZERO\")","v":"ZERO"},null,{"$f":"IF(Zestawienie!S21>0,Zestawienie!S21,\"ZERO\")","v":"ZERO"},{"$f":"IF(Zestawienie!T21>0,Zestawienie!T21,\"ZERO\")","v":"ZERO"},{"$f":"IF(Zestawienie!U21>0,Zestawienie!U21,\"ZERO\")","v":"ZERO"},{"$f":"IF(Zestawienie!V21>0,Zestawienie!V21,\"ZERO\")","v":"ZERO"},null,{"$f":"IF(Zestawienie!W21>0,Zestawienie!W21,\"ZERO\")","v":"ZERO"},{"$f":"IF(Zestawienie!X21>0,Zestawienie!X21,\"ZERO\")","v":"ZERO"},{"$f":"IF(Zestawienie!Y21>0,Zestawienie!Y21,\"ZERO\")","v":"ZERO"},{"$f":"IF(Zestawienie!Z21>0,Zestawienie!Z21,\"ZERO\")","v":"ZERO"},null,{"$f":"IF(Zestawienie!AA21>0,Zestawienie!AA21,\"ZERO\")","v":"ZERO"},{"$f":"IF(Zestawienie!AB21>0,Zestawienie!AB21,\"ZERO\")","v":"ZERO"},{"$f":"IF(Zestawienie!AC21>0,Zestawienie!AC21,\"ZERO\")","v":"ZERO"},{"$f":"IF(Zestawienie!AD21>0,Zestawienie!AD21,\"ZERO\")","v":"ZERO"},null,{"$f":"IF(Zestawienie!AE21>0,Zestawienie!AE21,\"ZERO\")","v":"ZERO"},{"$f":"IF(Zestawienie!AF21>0,Zestawienie!AF21,\"ZERO\")","v":"ZERO"},{"$f":"IF(Zestawienie!AG21>0,Zestawienie!AG21,\"ZERO\")","v":"ZERO"},{"$f":"IF(Zestawienie!AH21>0,Zestawienie!AH21,\"ZERO\")","v":"ZERO"},null,{"$f":"IF(Zestawienie!AI21>0,Zestawienie!AI21,\"ZERO\")","v":"ZERO"},{"$f":"IF(Zestawienie!AJ21>0,Zestawienie!AJ21,\"ZERO\")","v":"ZERO"},{"$f":"IF(Zestawienie!AK21>0,Zestawienie!AK21,\"ZERO\")","v":"ZERO"},{"$f":"IF(Zestawienie!AL21>0,Zestawienie!AL21,\"ZERO\")","v":"ZERO"}]
[{"$f":"Zestawienie!A22","v":13},{"$f":"Dane!D15","v":0},{"$f":"IF(Zestawienie!C22>0,Zestawienie!C22,\"ZERO\")","v":"ZERO"},{"$f":"IF(Zestawienie!D22>0,Zestawienie!D22,\"ZERO\")","v":"ZERO"},{"$f":"IF(Zestawienie!E22>0,Zestawienie!E22,\"ZERO\")","v":"ZERO"},{"$f":"IF(Zestawienie!F22>0,Zestawienie!F22,\"ZERO\")","v":"ZERO"},null,{"$f":"IF(Zestawienie!G22>0,Zestawienie!G22,\"ZERO\")","v":"ZERO"},{"$f":"IF(Zestawienie!H22>0,Zestawienie!H22,\"ZERO\")","v":"ZERO"},{"$f":"IF(Zestawienie!I22>0,Zestawienie!I22,\"ZERO\")","v":"ZERO"},{"$f":"IF(Zestawienie!J22>0,Zestawienie!J22,\"ZERO\")","v":"ZERO"},null,{"$f":"IF(Zestawienie!K22>0,Zestawienie!K22,\"ZERO\")","v":"ZERO"},{"$f":"IF(Zestawienie!L22>0,Zestawienie!L22,\"ZERO\")","v":"ZERO"},{"$f":"IF(Zestawienie!M22>0,Zestawienie!M22,\"ZERO\")","v":"ZERO"},{"$f":"IF(Zestawienie!N22>0,Zestawienie!N22,\"ZERO\")","v":"ZERO"},null,{"$f":"IF(Zestawienie!O22>0,Zestawienie!O22,\"ZERO\")","v":"ZERO"},{"$f":"IF(Zestawienie!P22>0,Zestawienie!P22,\"ZERO\")","v":"ZERO"},{"$f":"IF(Zestawienie!Q22>0,Zestawienie!Q22,\"ZERO\")","v":"ZERO"},{"$f":"IF(Zestawienie!R22>0,Zestawienie!R22,\"ZERO\")","v":"ZERO"},null,{"$f":"IF(Zestawienie!S22>0,Zestawienie!S22,\"ZERO\")","v":"ZERO"},{"$f":"IF(Zestawienie!T22>0,Zestawienie!T22,\"ZERO\")","v":"ZERO"},{"$f":"IF(Zestawienie!U22>0,Zestawienie!U22,\"ZERO\")","v":"ZERO"},{"$f":"IF(Zestawienie!V22>0,Zestawienie!V22,\"ZERO\")","v":"ZERO"},null,{"$f":"IF(Zestawienie!W22>0,Zestawienie!W22,\"ZERO\")","v":"ZERO"},{"$f":"IF(Zestawienie!X22>0,Zestawienie!X22,\"ZERO\")","v":"ZERO"},{"$f":"IF(Zestawienie!Y22>0,Zestawienie!Y22,\"ZERO\")","v":"ZERO"},{"$f":"IF(Zestawienie!Z22>0,Zestawienie!Z22,\"ZERO\")","v":"ZERO"},null,{"$f":"IF(Zestawienie!AA22>0,Zestawienie!AA22,\"ZERO\")","v":"ZERO"},{"$f":"IF(Zestawienie!AB22>0,Zestawienie!AB22,\"ZERO\")","v":"ZERO"},{"$f":"IF(Zestawienie!AC22>0,Zestawienie!AC22,\"ZERO\")","v":"ZERO"},{"$f":"IF(Zestawienie!AD22>0,Zestawienie!AD22,\"ZERO\")","v":"ZERO"},null,{"$f":"IF(Zestawienie!AE22>0,Zestawienie!AE22,\"ZERO\")","v":"ZERO"},{"$f":"IF(Zestawienie!AF22>0,Zestawienie!AF22,\"ZERO\")","v":"ZERO"},{"$f":"IF(Zestawienie!AG22>0,Zestawienie!AG22,\"ZERO\")","v":"ZERO"},{"$f":"IF(Zestawienie!AH22>0,Zestawienie!AH22,\"ZERO\")","v":"ZERO"},null,{"$f":"IF(Zestawienie!AI22>0,Zestawienie!AI22,\"ZERO\")","v":"ZERO"},{"$f":"IF(Zestawienie!AJ22>0,Zestawienie!AJ22,\"ZERO\")","v":"ZERO"},{"$f":"IF(Zestawienie!AK22>0,Zestawienie!AK22,\"ZERO\")","v":"ZERO"},{"$f":"IF(Zestawienie!AL22>0,Zestawienie!AL22,\"ZERO\")","v":"ZERO"}]
[{"$f":"Zestawienie!A23","v":14},{"$f":"Dane!D16","v":0},{"$f":"IF(Zestawienie!C23>0,Zestawienie!C23,\"ZERO\")","v":"ZERO"},{"$f":"IF(Zestawienie!D23>0,Zestawienie!D23,\"ZERO\")","v":"ZERO"},{"$f":"IF(Zestawienie!E23>0,Zestawienie!E23,\"ZERO\")","v":"ZERO"},{"$f":"IF(Zestawienie!F23>0,Zestawienie!F23,\"ZERO\")","v":"ZERO"},null,{"$f":"IF(Zestawienie!G23>0,Zestawienie!G23,\"ZERO\")","v":"ZERO"},{"$f":"IF(Zestawienie!H23>0,Zestawienie!H23,\"ZERO\")","v":"ZERO"},{"$f":"IF(Zestawienie!I23>0,Zestawienie!I23,\"ZERO\")","v":"ZERO"},{"$f":"IF(Zestawienie!J23>0,Zestawienie!J23,\"ZERO\")","v":"ZERO"},null,{"$f":"IF(Zestawienie!K23>0,Zestawienie!K23,\"ZERO\")","v":"ZERO"},{"$f":"IF(Zestawienie!L23>0,Zestawienie!L23,\"ZERO\")","v":"ZERO"},{"$f":"IF(Zestawienie!M23>0,Zestawienie!M23,\"ZERO\")","v":"ZERO"},{"$f":"IF(Zestawienie!N23>0,Zestawienie!N23,\"ZERO\")","v":"ZERO"},null,{"$f":"IF(Zestawienie!O23>0,Zestawienie!O23,\"ZERO\")","v":"ZERO"},{"$f":"IF(Zestawienie!P23>0,Zestawienie!P23,\"ZERO\")","v":"ZERO"},{"$f":"IF(Zestawienie!Q23>0,Zestawienie!Q23,\"ZERO\")","v":"ZERO"},{"$f":"IF(Zestawienie!R23>0,Zestawienie!R23,\"ZERO\")","v":"ZERO"},null,{"$f":"IF(Zestawienie!S23>0,Zestawienie!S23,\"ZERO\")","v":"ZERO"},{"$f":"IF(Zestawienie!T23>0,Zestawienie!T23,\"ZERO\")","v":"ZERO"},{"$f":"IF(Zestawienie!U23>0,Zestawienie!U23,\"ZERO\")","v":"ZERO"},{"$f":"IF(Zestawienie!V23>0,Zestawienie!V23,\"ZERO\")","v":"ZERO"},null,{"$f":"IF(Zestawienie!W23>0,Zestawienie!W23,\"ZERO\")","v":"ZERO"},{"$f":"IF(Zestawienie!X23>0,Zestawienie!X23,\"ZERO\")","v":"ZERO"},{"$f":"IF(Zestawienie!Y23>0,Zestawienie!Y23,\"ZERO\")","v":"ZERO"},{"$f":"IF(Zestawienie!Z23>0,Zestawienie!Z23,\"ZERO\")","v":"ZERO"},null,{"$f":"IF(Zestawienie!AA23>0,Zestawienie!AA23,\"ZERO\")","v":"ZERO"},{"$f":"IF(Zestawienie!AB23>0,Zestawienie!AB23,\"ZERO\")","v":"ZERO"},{"$f":"IF(Zestawienie!AC23>0,Zestawienie!AC23,\"ZERO\")","v":"ZERO"},{"$f":"IF(Zestawienie!AD23>0,Zestawienie!AD23,\"ZERO\")","v":"ZERO"},null,{"$f":"IF(Zestawienie!AE23>0,Zestawienie!AE23,\"ZERO\")","v":"ZERO"},{"$f":"IF(Zestawienie!AF23>0,Zestawienie!AF23,\"ZERO\")","v":"ZERO"},{"$f":"IF(Zestawienie!AG23>0,Zestawienie!AG23,\"ZERO\")","v":"ZERO"},{"$f":"IF(Zestawienie!AH23>0,Zestawienie!AH23,\"ZERO\")","v":"ZERO"},null,{"$f":"IF(Zestawienie!AI23>0,Zestawienie!AI23,\"ZERO\")","v":"ZERO"},{"$f":"IF(Zestawienie!AJ23>0,Zestawienie!AJ23,\"ZERO\")","v":"ZERO"},{"$f":"IF(Zestawienie!AK23>0,Zestawienie!AK23,\"ZERO\")","v":"ZERO"},{"$f":"IF(Zestawienie!AL23>0,Zestawienie!AL23,\"ZERO\")","v":"ZERO"}]
[{"$f":"Zestawienie!A24","v":15},{"$f":"Dane!D17","v":0},{"$f":"IF(Zestawienie!C24>0,Zestawienie!C24,\"ZERO\")","v":"ZERO"},{"$f":"IF(Zestawienie!D24>0,Zestawienie!D24,\"ZERO\")","v":"ZERO"},{"$f":"IF(Zestawienie!E24>0,Zestawienie!E24,\"ZERO\")","v":"ZERO"},{"$f":"IF(Zestawienie!F24>0,Zestawienie!F24,\"ZERO\")","v":"ZERO"},null,{"$f":"IF(Zestawienie!G24>0,Zestawienie!G24,\"ZERO\")","v":"ZERO"},{"$f":"IF(Zestawienie!H24>0,Zestawienie!H24,\"ZERO\")","v":"ZERO"},{"$f":"IF(Zestawienie!I24>0,Zestawienie!I24,\"ZERO\")","v":"ZERO"},{"$f":"IF(Zestawienie!J24>0,Zestawienie!J24,\"ZERO\")","v":"ZERO"},null,{"$f":"IF(Zestawienie!K24>0,Zestawienie!K24,\"ZERO\")","v":"ZERO"},{"$f":"IF(Zestawienie!L24>0,Zestawienie!L24,\"ZERO\")","v":"ZERO"},{"$f":"IF(Zestawienie!M24>0,Zestawienie!M24,\"ZERO\")","v":"ZERO"},{"$f":"IF(Zestawienie!N24>0,Zestawienie!N24,\"ZERO\")","v":"ZERO"},null,{"$f":"IF(Zestawienie!O24>0,Zestawienie!O24,\"ZERO\")","v":"ZERO"},{"$f":"IF(Zestawienie!P24>0,Zestawienie!P24,\"ZERO\")","v":"ZERO"},{"$f":"IF(Zestawienie!Q24>0,Zestawienie!Q24,\"ZERO\")","v":"ZERO"},{"$f":"IF(Zestawienie!R24>0,Zestawienie!R24,\"ZERO\")","v":"ZERO"},null,{"$f":"IF(Zestawienie!S24>0,Zestawienie!S24,\"ZERO\")","v":"ZERO"},{"$f":"IF(Zestawienie!T24>0,Zestawienie!T24,\"ZERO\")","v":"ZERO"},{"$f":"IF(Zestawienie!U24>0,Zestawienie!U24,\"ZERO\")","v":"ZERO"},{"$f":"IF(Zestawienie!V24>0,Zestawienie!V24,\"ZERO\")","v":"ZERO"},null,{"$f":"IF(Zestawienie!W24>0,Zestawienie!W24,\"ZERO\")","v":"ZERO"},{"$f":"IF(Zestawienie!X24>0,Zestawienie!X24,\"ZERO\")","v":"ZERO"},{"$f":"IF(Zestawienie!Y24>0,Zestawienie!Y24,\"ZERO\")","v":"ZERO"},{"$f":"IF(Zestawienie!Z24>0,Zestawienie!Z24,\"ZERO\")","v":"ZERO"},null,{"$f":"IF(Zestawienie!AA24>0,Zestawienie!AA24,\"ZERO\")","v":"ZERO"},{"$f":"IF(Zestawienie!AB24>0,Zestawienie!AB24,\"ZERO\")","v":"ZERO"},{"$f":"IF(Zestawienie!AC24>0,Zestawienie!AC24,\"ZERO\")","v":"ZERO"},{"$f":"IF(Zestawienie!AD24>0,Zestawienie!AD24,\"ZERO\")","v":"ZERO"},null,{"$f":"IF(Zestawienie!AE24>0,Zestawienie!AE24,\"ZERO\")","v":"ZERO"},{"$f":"IF(Zestawienie!AF24>0,Zestawienie!AF24,\"ZERO\")","v":"ZERO"},{"$f":"IF(Zestawienie!AG24>0,Zestawienie!AG24,\"ZERO\")","v":"ZERO"},{"$f":"IF(Zestawienie!AH24>0,Zestawienie!AH24,\"ZERO\")","v":"ZERO"},null,{"$f":"IF(Zestawienie!AI24>0,Zestawienie!AI24,\"ZERO\")","v":"ZERO"},{"$f":"IF(Zestawienie!AJ24>0,Zestawienie!AJ24,\"ZERO\")","v":"ZERO"},{"$f":"IF(Zestawienie!AK24>0,Zestawienie!AK24,\"ZERO\")","v":"ZERO"},{"$f":"IF(Zestawienie!AL24>0,Zestawienie!AL24,\"ZERO\")","v":"ZERO"}]
[{"$f":"Zestawienie!A25","v":16},{"$f":"Dane!D18","v":0},{"$f":"IF(Zestawienie!C25>0,Zestawienie!C25,\"ZERO\")","v":"ZERO"},{"$f":"IF(Zestawienie!D25>0,Zestawienie!D25,\"ZERO\")","v":"ZERO"},{"$f":"IF(Zestawienie!E25>0,Zestawienie!E25,\"ZERO\")","v":"ZERO"},{"$f":"IF(Zestawienie!F25>0,Zestawienie!F25,\"ZERO\")","v":"ZERO"},null,{"$f":"IF(Zestawienie!G25>0,Zestawienie!G25,\"ZERO\")","v":"ZERO"},{"$f":"IF(Zestawienie!H25>0,Zestawienie!H25,\"ZERO\")","v":"ZERO"},{"$f":"IF(Zestawienie!I25>0,Zestawienie!I25,\"ZERO\")","v":"ZERO"},{"$f":"IF(Zestawienie!J25>0,Zestawienie!J25,\"ZERO\")","v":"ZERO"},null,{"$f":"IF(Zestawienie!K25>0,Zestawienie!K25,\"ZERO\")","v":"ZERO"},{"$f":"IF(Zestawienie!L25>0,Zestawienie!L25,\"ZERO\")","v":"ZERO"},{"$f":"IF(Zestawienie!M25>0,Zestawienie!M25,\"ZERO\")","v":"ZERO"},{"$f":"IF(Zestawienie!N25>0,Zestawienie!N25,\"ZERO\")","v":"ZERO"},null,{"$f":"IF(Zestawienie!O25>0,Zestawienie!O25,\"ZERO\")","v":"ZERO"},{"$f":"IF(Zestawienie!P25>0,Zestawienie!P25,\"ZERO\")","v":"ZERO"},{"$f":"IF(Zestawienie!Q25>0,Zestawienie!Q25,\"ZERO\")","v":"ZERO"},{"$f":"IF(Zestawienie!R25>0,Zestawienie!R25,\"ZERO\")","v":"ZERO"},null,{"$f":"IF(Zestawienie!S25>0,Zestawienie!S25,\"ZERO\")","v":"ZERO"},{"$f":"IF(Zestawienie!T25>0,Zestawienie!T25,\"ZERO\")","v":"ZERO"},{"$f":"IF(Zestawienie!U25>0,Zestawienie!U25,\"ZERO\")","v":"ZERO"},{"$f":"IF(Zestawienie!V25>0,Zestawienie!V25,\"ZERO\")","v":"ZERO"},null,{"$f":"IF(Zestawienie!W25>0,Zestawienie!W25,\"ZERO\")","v":"ZERO"},{"$f":"IF(Zestawienie!X25>0,Zestawienie!X25,\"ZERO\")","v":"ZERO"},{"$f":"IF(Zestawienie!Y25>0,Zestawienie!Y25,\"ZERO\")","v":"ZERO"},{"$f":"IF(Zestawienie!Z25>0,Zestawienie!Z25,\"ZERO\")","v":"ZERO"},null,{"$f":"IF(Zestawienie!AA25>0,Zestawienie!AA25,\"ZERO\")","v":"ZERO"},{"$f":"IF(Zestawienie!AB25>0,Zestawienie!AB25,\"ZERO\")","v":"ZERO"},{"$f":"IF(Zestawienie!AC25>0,Zestawienie!AC25,\"ZERO\")","v":"ZERO"},{"$f":"IF(Zestawienie!AD25>0,Zestawienie!AD25,\"ZERO\")","v":"ZERO"},null,{"$f":"IF(Zestawienie!AE25>0,Zestawienie!AE25,\"ZERO\")","v":"ZERO"},{"$f":"IF(Zestawienie!AF25>0,Zestawienie!AF25,\"ZERO\")","v":"ZERO"},{"$f":"IF(Zestawienie!AG25>0,Zestawienie!AG25,\"ZERO\")","v":"ZERO"},{"$f":"IF(Zestawienie!AH25>0,Zestawienie!AH25,\"ZERO\")","v":"ZERO"},null,{"$f":"IF(Zestawienie!AI25>0,Zestawienie!AI25,\"ZERO\")","v":"ZERO"},{"$f":"IF(Zestawienie!AJ25>0,Zestawienie!AJ25,\"ZERO\")","v":"ZERO"},{"$f":"IF(Zestawienie!AK25>0,Zestawienie!AK25,\"ZERO\")","v":"ZERO"},{"$f":"IF(Zestawienie!AL25>0,Zestawienie!AL25,\"ZERO\")","v":"ZERO"}]
[{"$f":"Zestawienie!A26","v":17},{"$f":"Dane!D19","v":0},{"$f":"IF(Zestawienie!C26>0,Zestawienie!C26,\"ZERO\")","v":"ZERO"},{"$f":"IF(Zestawienie!D26>0,Zestawienie!D26,\"ZERO\")","v":"ZERO"},{"$f":"IF(Zestawienie!E26>0,Zestawienie!E26,\"ZERO\")","v":"ZERO"},{"$f":"IF(Zestawienie!F26>0,Zestawienie!F26,\"ZERO\")","v":"ZERO"},null,{"$f":"IF(Zestawienie!G26>0,Zestawienie!G26,\"ZERO\")","v":"ZERO"},{"$f":"IF(Zestawienie!H26>0,Zestawienie!H26,\"ZERO\")","v":"ZERO"},{"$f":"IF(Zestawienie!I26>0,Zestawienie!I26,\"ZERO\")","v":"ZERO"},{"$f":"IF(Zestawienie!J26>0,Zestawienie!J26,\"ZERO\")","v":"ZERO"},null,{"$f":"IF(Zestawienie!K26>0,Zestawienie!K26,\"ZERO\")","v":"ZERO"},{"$f":"IF(Zestawienie!L26>0,Zestawienie!L26,\"ZERO\")","v":"ZERO"},{"$f":"IF(Zestawienie!M26>0,Zestawienie!M26,\"ZERO\")","v":"ZERO"},{"$f":"IF(Zestawienie!N26>0,Zestawienie!N26,\"ZERO\")","v":"ZERO"},null,{"$f":"IF(Zestawienie!O26>0,Zestawienie!O26,\"ZERO\")","v":"ZERO"},{"$f":"IF(Zestawienie!P26>0,Zestawienie!P26,\"ZERO\")","v":"ZERO"},{"$f":"IF(Zestawienie!Q26>0,Zestawienie!Q26,\"ZERO\")","v":"ZERO"},{"$f":"IF(Zestawienie!R26>0,Zestawienie!R26,\"ZERO\")","v":"ZERO"},null,{"$f":"IF(Zestawienie!S26>0,Zestawienie!S26,\"ZERO\")","v":"ZERO"},{"$f":"IF(Zestawienie!T26>0,Zestawienie!T26,\"ZERO\")","v":"ZERO"},{"$f":"IF(Zestawienie!U26>0,Zestawienie!U26,\"ZERO\")","v":"ZERO"},{"$f":"IF(Zestawienie!V26>0,Zestawienie!V26,\"ZERO\")","v":"ZERO"},null,{"$f":"IF(Zestawienie!W26>0,Zestawienie!W26,\"ZERO\")","v":"ZERO"},{"$f":"IF(Zestawienie!X26>0,Zestawienie!X26,\"ZERO\")","v":"ZERO"},{"$f":"IF(Zestawienie!Y26>0,Zestawienie!Y26,\"ZERO\")","v":"ZERO"},{"$f":"IF(Zestawienie!Z26>0,Zestawienie!Z26,\"ZERO\")","v":"ZERO"},null,{"$f":"IF(Zestawienie!AA26>0,Zestawienie!AA26,\"ZERO\")","v":"ZERO"},{"$f":"IF(Zestawienie!AB26>0,Zestawienie!AB26,\"ZERO\")","v":"ZERO"},{"$f":"IF(Zestawienie!AC26>0,Zestawienie!AC26,\"ZERO\")","v":"ZERO"},{"$f":"IF(Zestawienie!AD26>0,Zestawienie!AD26,\"ZERO\")","v":"ZERO"},null,{"$f":"IF(Zestawienie!AE26>0,Zestawienie!AE26,\"ZERO\")","v":"ZERO"},{"$f":"IF(Zestawienie!AF26>0,Zestawienie!AF26,\"ZERO\")","v":"ZERO"},{"$f":"IF(Zestawienie!AG26>0,Zestawienie!AG26,\"ZERO\")","v":"ZERO"},{"$f":"IF(Zestawienie!AH26>0,Zestawienie!AH26,\"ZERO\")","v":"ZERO"},null,{"$f":"IF(Zestawienie!AI26>0,Zestawienie!AI26,\"ZERO\")","v":"ZERO"},{"$f":"IF(Zestawienie!AJ26>0,Zestawienie!AJ26,\"ZERO\")","v":"ZERO"},{"$f":"IF(Zestawienie!AK26>0,Zestawienie!AK26,\"ZERO\")","v":"ZERO"},{"$f":"IF(Zestawienie!AL26>0,Zestawienie!AL26,\"ZERO\")","v":"ZERO"}]
[{"$f":"Zestawienie!A27","v":18},{"$f":"Dane!D20","v":0},{"$f":"IF(Zestawienie!C27>0,Zestawienie!C27,\"ZERO\")","v":"ZERO"},{"$f":"IF(Zestawienie!D27>0,Zestawienie!D27,\"ZERO\")","v":"ZERO"},{"$f":"IF(Zestawienie!E27>0,Zestawienie!E27,\"ZERO\")","v":"ZERO"},{"$f":"IF(Zestawienie!F27>0,Zestawienie!F27,\"ZERO\")","v":"ZERO"},null,{"$f":"IF(Zestawienie!G27>0,Zestawienie!G27,\"ZERO\")","v":"ZERO"},{"$f":"IF(Zestawienie!H27>0,Zestawienie!H27,\"ZERO\")","v":"ZERO"},{"$f":"IF(Zestawienie!I27>0,Zestawienie!I27,\"ZERO\")","v":"ZERO"},{"$f":"IF(Zestawienie!J27>0,Zestawienie!J27,\"ZERO\")","v":"ZERO"},null,{"$f":"IF(Zestawienie!K27>0,Zestawienie!K27,\"ZERO\")","v":"ZERO"},{"$f":"IF(Zestawienie!L27>0,Zestawienie!L27,\"ZERO\")","v":"ZERO"},{"$f":"IF(Zestawienie!M27>0,Zestawienie!M27,\"ZERO\")","v":"ZERO"},{"$f":"IF(Zestawienie!N27>0,Zestawienie!N27,\"ZERO\")","v":"ZERO"},null,{"$f":"IF(Zestawienie!O27>0,Zestawienie!O27,\"ZERO\")","v":"ZERO"},{"$f":"IF(Zestawienie!P27>0,Zestawienie!P27,\"ZERO\")","v":"ZERO"},{"$f":"IF(Zestawienie!Q27>0,Zestawienie!Q27,\"ZERO\")","v":"ZERO"},{"$f":"IF(Zestawienie!R27>0,Zestawienie!R27,\"ZERO\")","v":"ZERO"},null,{"$f":"IF(Zestawienie!S27>0,Zestawienie!S27,\"ZERO\")","v":"ZERO"},{"$f":"IF(Zestawienie!T27>0,Zestawienie!T27,\"ZERO\")","v":"ZERO"},{"$f":"IF(Zestawienie!U27>0,Zestawienie!U27,\"ZERO\")","v":"ZERO"},{"$f":"IF(Zestawienie!V27>0,Zestawienie!V27,\"ZERO\")","v":"ZERO"},null,{"$f":"IF(Zestawienie!W27>0,Zestawienie!W27,\"ZERO\")","v":"ZERO"},{"$f":"IF(Zestawienie!X27>0,Zestawienie!X27,\"ZERO\")","v":"ZERO"},{"$f":"IF(Zestawienie!Y27>0,Zestawienie!Y27,\"ZERO\")","v":"ZERO"},{"$f":"IF(Zestawienie!Z27>0,Zestawienie!Z27,\"ZERO\")","v":"ZERO"},null,{"$f":"IF(Zestawienie!AA27>0,Zestawienie!AA27,\"ZERO\")","v":"ZERO"},{"$f":"IF(Zestawienie!AB27>0,Zestawienie!AB27,\"ZERO\")","v":"ZERO"},{"$f":"IF(Zestawienie!AC27>0,Zestawienie!AC27,\"ZERO\")","v":"ZERO"},{"$f":"IF(Zestawienie!AD27>0,Zestawienie!AD27,\"ZERO\")","v":"ZERO"},null,{"$f":"IF(Zestawienie!AE27>0,Zestawienie!AE27,\"ZERO\")","v":"ZERO"},{"$f":"IF(Zestawienie!AF27>0,Zestawienie!AF27,\"ZERO\")","v":"ZERO"},{"$f":"IF(Zestawienie!AG27>0,Zestawienie!AG27,\"ZERO\")","v":"ZERO"},{"$f":"IF(Zestawienie!AH27>0,Zestawienie!AH27,\"ZERO\")","v":"ZERO"},null,{"$f":"IF(Zestawienie!AI27>0,Zestawienie!AI27,\"ZERO\")","v":"ZERO"},{"$f":"IF(Zestawienie!AJ27>0,Zestawienie!AJ27,\"ZERO\")","v":"ZERO"},{"$f":"IF(Zestawienie!AK27>0,Zestawienie!AK27,\"ZERO\")","v":"ZERO"},{"$f":"IF(Zestawienie!AL27>0,Zestawienie!AL27,\"ZERO\")","v":"ZERO"}]
[{"$f":"Zestawienie!A28","v":19},{"$f":"Dane!D21","v":0},{"$f":"IF(Zestawienie!C28>0,Zestawienie!C28,\"ZERO\")","v":"ZERO"},{"$f":"IF(Zestawienie!D28>0,Zestawienie!D28,\"ZERO\")","v":"ZERO"},{"$f":"IF(Zestawienie!E28>0,Zestawienie!E28,\"ZERO\")","v":"ZERO"},{"$f":"IF(Zestawienie!F28>0,Zestawienie!F28,\"ZERO\")","v":"ZERO"},null,{"$f":"IF(Zestawienie!G28>0,Zestawienie!G28,\"ZERO\")","v":"ZERO"},{"$f":"IF(Zestawienie!H28>0,Zestawienie!H28,\"ZERO\")","v":"ZERO"},{"$f":"IF(Zestawienie!I28>0,Zestawienie!I28,\"ZERO\")","v":"ZERO"},{"$f":"IF(Zestawienie!J28>0,Zestawienie!J28,\"ZERO\")","v":"ZERO"},null,{"$f":"IF(Zestawienie!K28>0,Zestawienie!K28,\"ZERO\")","v":"ZERO"},{"$f":"IF(Zestawienie!L28>0,Zestawienie!L28,\"ZERO\")","v":"ZERO"},{"$f":"IF(Zestawienie!M28>0,Zestawienie!M28,\"ZERO\")","v":"ZERO"},{"$f":"IF(Zestawienie!N28>0,Zestawienie!N28,\"ZERO\")","v":"ZERO"},null,{"$f":"IF(Zestawienie!O28>0,Zestawienie!O28,\"ZERO\")","v":"ZERO"},{"$f":"IF(Zestawienie!P28>0,Zestawienie!P28,\"ZERO\")","v":"ZERO"},{"$f":"IF(Zestawienie!Q28>0,Zestawienie!Q28,\"ZERO\")","v":"ZERO"},{"$f":"IF(Zestawienie!R28>0,Zestawienie!R28,\"ZERO\")","v":"ZERO"},null,{"$f":"IF(Zestawienie!S28>0,Zestawienie!S28,\"ZERO\")","v":"ZERO"},{"$f":"IF(Zestawienie!T28>0,Zestawienie!T28,\"ZERO\")","v":"ZERO"},{"$f":"IF(Zestawienie!U28>0,Zestawienie!U28,\"ZERO\")","v":"ZERO"},{"$f":"IF(Zestawienie!V28>0,Zestawienie!V28,\"ZERO\")","v":"ZERO"},null,{"$f":"IF(Zestawienie!W28>0,Zestawienie!W28,\"ZERO\")","v":"ZERO"},{"$f":"IF(Zestawienie!X28>0,Zestawienie!X28,\"ZERO\")","v":"ZERO"},{"$f":"IF(Zestawienie!Y28>0,Zestawienie!Y28,\"ZERO\")","v":"ZERO"},{"$f":"IF(Zestawienie!Z28>0,Zestawienie!Z28,\"ZERO\")","v":"ZERO"},null,{"$f":"IF(Zestawienie!AA28>0,Zestawienie!AA28,\"ZERO\")","v":"ZERO"},{"$f":"IF(Zestawienie!AB28>0,Zestawienie!AB28,\"ZERO\")","v":"ZERO"},{"$f":"IF(Zestawienie!AC28>0,Zestawienie!AC28,\"ZERO\")","v":"ZERO"},{"$f":"IF(Zestawienie!AD28>0,Zestawienie!AD28,\"ZERO\")","v":"ZERO"},null,{"$f":"IF(Zestawienie!AE28>0,Zestawienie!AE28,\"ZERO\")","v":"ZERO"},{"$f":"IF(Zestawienie!AF28>0,Zestawienie!AF28,\"ZERO\")","v":"ZERO"},{"$f":"IF(Zestawienie!AG28>0,Zestawienie!AG28,\"ZERO\")","v":"ZERO"},{"$f":"IF(Zestawienie!AH28>0,Zestawienie!AH28,\"ZERO\")","v":"ZERO"},null,{"$f":"IF(Zestawienie!AI28>0,Zestawienie!AI28,\"ZERO\")","v":"ZERO"},{"$f":"IF(Zestawienie!AJ28>0,Zestawienie!AJ28,\"ZERO\")","v":"ZERO"},{"$f":"IF(Zestawienie!AK28>0,Zestawienie!AK28,\"ZERO\")","v":"ZERO"},{"$f":"IF(Zestawienie!AL28>0,Zestawienie!AL28,\"ZERO\")","v":"ZERO"}]
[{"$f":"Zestawienie!A29","v":20},{"$f":"Dane!D22","v":0},{"$f":"IF(Zestawienie!C29>0,Zestawienie!C29,\"ZERO\")","v":"ZERO"},{"$f":"IF(Zestawienie!D29>0,Zestawienie!D29,\"ZERO\")","v":"ZERO"},{"$f":"IF(Zestawienie!E29>0,Zestawienie!E29,\"ZERO\")","v":"ZERO"},{"$f":"IF(Zestawienie!F29>0,Zestawienie!F29,\"ZERO\")","v":"ZERO"},null,{"$f":"IF(Zestawienie!G29>0,Zestawienie!G29,\"ZERO\")","v":"ZERO"},{"$f":"IF(Zestawienie!H29>0,Zestawienie!H29,\"ZERO\")","v":"ZERO"},{"$f":"IF(Zestawienie!I29>0,Zestawienie!I29,\"ZERO\")","v":"ZERO"},{"$f":"IF(Zestawienie!J29>0,Zestawienie!J29,\"ZERO\")","v":"ZERO"},null,{"$f":"IF(Zestawienie!K29>0,Zestawienie!K29,\"ZERO\")","v":"ZERO"},{"$f":"IF(Zestawienie!L29>0,Zestawienie!L29,\"ZERO\")","v":"ZERO"},{"$f":"IF(Zestawienie!M29>0,Zestawienie!M29,\"ZERO\")","v":"ZERO"},{"$f":"IF(Zestawienie!N29>0,Zestawienie!N29,\"ZERO\")","v":"ZERO"},null,{"$f":"IF(Zestawienie!O29>0,Zestawienie!O29,\"ZERO\")","v":"ZERO"},{"$f":"IF(Zestawienie!P29>0,Zestawienie!P29,\"ZERO\")","v":"ZERO"},{"$f":"IF(Zestawienie!Q29>0,Zestawienie!Q29,\"ZERO\")","v":"ZERO"},{"$f":"IF(Zestawienie!R29>0,Zestawienie!R29,\"ZERO\")","v":"ZERO"},null,{"$f":"IF(Zestawienie!S29>0,Zestawienie!S29,\"ZERO\")","v":"ZERO"},{"$f":"IF(Zestawienie!T29>0,Zestawienie!T29,\"ZERO\")","v":"ZERO"},{"$f":"IF(Zestawienie!U29>0,Zestawienie!U29,\"ZERO\")","v":"ZERO"},{"$f":"IF(Zestawienie!V29>0,Zestawienie!V29,\"ZERO\")","v":"ZERO"},null,{"$f":"IF(Zestawienie!W29>0,Zestawienie!W29,\"ZERO\")","v":"ZERO"},{"$f":"IF(Zestawienie!X29>0,Zestawienie!X29,\"ZERO\")","v":"ZERO"},{"$f":"IF(Zestawienie!Y29>0,Zestawienie!Y29,\"ZERO\")","v":"ZERO"},{"$f":"IF(Zestawienie!Z29>0,Zestawienie!Z29,\"ZERO\")","v":"ZERO"},null,{"$f":"IF(Zestawienie!AA29>0,Zestawienie!AA29,\"ZERO\")","v":"ZERO"},{"$f":"IF(Zestawienie!AB29>0,Zestawienie!AB29,\"ZERO\")","v":"ZERO"},{"$f":"IF(Zestawienie!AC29>0,Zestawienie!AC29,\"ZERO\")","v":"ZERO"},{"$f":"IF(Zestawienie!AD29>0,Zestawienie!AD29,\"ZERO\")","v":"ZERO"},null,{"$f":"IF(Zestawienie!AE29>0,Zestawienie!AE29,\"ZERO\")","v":"ZERO"},{"$f":"IF(Zestawienie!AF29>0,Zestawienie!AF29,\"ZERO\")","v":"ZERO"},{"$f":"IF(Zestawienie!AG29>0,Zestawienie!AG29,\"ZERO\")","v":"ZERO"},{"$f":"IF(Zestawienie!AH29>0,Zestawienie!AH29,\"ZERO\")","v":"ZERO"},null,{"$f":"IF(Zestawienie!AI29>0,Zestawienie!AI29,\"ZERO\")","v":"ZERO"},{"$f":"IF(Zestawienie!AJ29>0,Zestawienie!AJ29,\"ZERO\")","v":"ZERO"},{"$f":"IF(Zestawienie!AK29>0,Zestawienie!AK29,\"ZERO\")","v":"ZERO"},{"$f":"IF(Zestawienie!AL29>0,Zestawienie!AL29,\"ZERO\")","v":"ZERO"}]
[]
[]
[]
[]
[]
[]
[{"$f":"A3","v":"Nr oferty"},{"$f":"B3","v":"Nazwa Wykonawcy"},{"$nulls":5},{"$f":"H3","v":"Zadanie 2"},{"$nulls":4},{"$f":"M3","v":"Zadanie 3"},{"$nulls":4},{"$f":"R3","v":"Zadanie 4"},{"$nulls":4},{"$f":"W3","v":"Zadanie 5"},{"$nulls":4},{"$f":"AB3","v":"Zadanie 6"},{"$nulls":4},{"$f":"AG3","v":"Zadanie 7"},{"$nulls":4},{"$f":"AL3","v":"Zadanie 8"},{"$nulls":4},{"$f":"AQ3","v":"Zadanie 9"}]
[{"$f":"Zestawienie!A37","v":0},{"$f":"Zestawienie!B37","v":0},{"$f":"C4","v":"Cena -  50%"},{"$f":"D4","v":"Doświadczenie trenera w realizacji szkolen/warsztetów interpersonalnych ( w godzinach) 40%"},"Termin przeprowadzenia I Warsztatu  (w dniach) 10%"," %","Razem","Cena -  60%"," %"," %"," %","Razem","Cena -  60%"," %"," %"," %","Razem","Cena -  60%"," %"," %"," %","Razem","Cena -  60%"," %"," %"," %","Razem","Cena -  60%"," %"," %"," %","Razem","Cena -  60%"," %"," %"," %","Razem","Cena -  60%"," %"," %"," %","Razem","Cena -  60%","Okres gwarancji (w miesiącach) - %","Termin płatności (w dniach) -  %"," %","Razem"]
[1,{"$f":"Zestawienie!B10","v":"Nowoczesny Osrodek Edukacji Anna Ratuszniak\nul. Zaułek Szkolny 24\n55-002 Kamieniec Wrocławski"},{"$f":"IF(C$1=\"M\",MIN(C$5:C$24)/C5*C$2,IF(C$1=\"R\",C5/MAX(C$5:C$24)*C$2,\"00\"))","v":{"v":16.758333333333333,"d":"16.8"}},{"$f":"IF(D$1=\"M\",MIN(D$5:D$24)/D5*D$2,IF(D$1=\"R\",D5/MAX(D$5:D$24)*D$2,\"00\"))","v":{"v":28.10168372400132,"d":"28.1"}},{"v":10,"d":"10.0"},"00",{"$f":"C33+D33+E33+F33","v":{"v":54.86001705733465,"d":"54.9"}},{"$f":"IF(H$1=\"M\",MIN(H$5:H$24)/H5*H$2,IF(H$1=\"R\",H5/MAX(H$5:H$24)*H$2,\"00\"))","v":{"$error":"#VALUE!"}},{"$f":"IF(I$1=\"M\",MIN(I$5:I$24)/I5*I$2,IF(I$1=\"R\",I5/MAX(I$5:I$24)*I$2,\"00\"))","v":"00"},"00","00",{"$f":"H33+I33+J33+K33","v":{"$error":"#VALUE!"}},{"$f":"IF(M$1=\"M\",MIN(M$5:M$24)/M5*M$2,IF(M$1=\"R\",M5/MAX(M$5:M$24)*M$2,\"00\"))","v":{"$error":"#VALUE!"}},{"$f":"IF(N$1=\"M\",MIN(N$5:N$24)/N5*N$2,IF(N$1=\"R\",N5/MAX(N$5:N$24)*N$2,\"00\"))","v":"00"},"00","00",{"$f":"M33+N33+O33+P33","v":{"$error":"#VALUE!"}},{"$f":"IF(R$1=\"M\",MIN(R$5:R$24)/R5*R$2,IF(R$1=\"R\",R5/MAX(R$5:R$24)*R$2,\"00\"))","v":{"$error":"#VALUE!"}},{"$f":"IF(S$1=\"M\",MIN(S$5:S$24)/S5*S$2,IF(S$1=\"R\",S5/MAX(S$5:S$24)*S$2,\"00\"))","v":"00"},"00","00",{"$f":"R33+S33+T33+U33","v":{"$error":"#VALUE!"}},{"$f":"IF(W$1=\"M\",MIN(W$5:W$24)/W5*W$2,IF(W$1=\"R\",W5/MAX(W$5:W$24)*W$2,\"00\"))","v":{"$error":"#VALUE!"}},{"$f":"IF(X$1=\"M\",MIN(X$5:X$24)/X5*X$2,IF(X$1=\"R\",X5/MAX(X$5:X$24)*X$2,\"00\"))","v":"00"},"00","00",{"$f":"W33+X33+Y33+Z33","v":{"$error":"#VALUE!"}},{"$f":"IF(AB$1=\"M\",MIN(AB$5:AB$24)/AB5*AB$2,IF(AB$1=\"R\",AB5/MAX(AB$5:AB$24)*AB$2,\"00\"))","v":{"$error":"#VALUE!"}},{"$f":"IF(AC$1=\"M\",MIN(AC$5:AC$24)/AC5*AC$2,IF(AC$1=\"R\",AC5/MAX(AC$5:AC$24)*AC$2,\"00\"))","v":"00"},"00","00",{"$f":"AB33+AC33+AD33+AE33","v":{"$error":"#VALUE!"}},{"$f":"IF(AG$1=\"M\",MIN(AG$5:AG$24)/AG5*AG$2,IF(AG$1=\"R\",AG5/MAX(AG$5:AG$24)*AG$2,\"00\"))","v":{"$error":"#VALUE!"}},{"$f":"IF(AH$1=\"M\",MIN(AH$5:AH$24)/AH5*AH$2,IF(AH$1=\"R\",AH5/MAX(AH$5:AH$24)*AH$2,\"00\"))","v":"00"},"00","00",{"$f":"AG33+AH33+AI33+AJ33","v":{"$error":"#VALUE!"}},{"$f":"IF(AL$1=\"M\",MIN(AL$5:AL$24)/AL5*AL$2,IF(AL$1=\"R\",AL5/MAX(AL$5:AL$24)*AL$2,\"00\"))","v":{"$error":"#VALUE!"}},{"$f":"IF(AM$1=\"M\",MIN(AM$5:AM$24)/AM5*AM$2,IF(AM$1=\"R\",AM5/MAX(AM$5:AM$24)*AM$2,\"00\"))","v":"00"},"00","00",{"$f":"AL33+AM33+AN33+AO33","v":{"$error":"#VALUE!"}},{"$f":"IF(AQ$1=\"M\",MIN(AQ$5:AQ$24)/AQ5*AQ$2,IF(AQ$1=\"R\",AQ5/MAX(AQ$5:AQ$24)*AQ$2,\"00\"))","v":{"$error":"#VALUE!"}},{"$f":"IF(AR$1=\"M\",MIN(AR$5:AR$24)/AR5*AR$2,IF(AR$1=\"R\",AR5/MAX(AR$5:AR$24)*AR$2,\"00\"))","v":"00"},"00","00",{"$f":"AQ33+AR33+AS33+AT33","v":{"$error":"#VALUE!"}}]
[2,{"$f":"Zestawienie!B11","v":"Agencja Analiz i Doradztwa Personalnego Remigiusz Koc\nul. Gdańska 105/4\n85-022 Bydgoszcz"},{"$f":"IF(C$1=\"M\",MIN(C$5:C$24)/C6*C$2,IF(C$1=\"R\",C6/MAX(C$5:C$24)*C$2,\"00\"))","v":{"v":30.05439980870397,"d":"30.1"}},{"v":9.712776493892374,"d":"9.7"},{"v":10,"d":"10.0"},"00",{"$f":"C34+D34+E34+F34","v":{"v":49.76717630259634,"d":"49.8"}},{"$f":"IF(H$1=\"M\",MIN(H$5:H$24)/H6*H$2,IF(H$1=\"R\",H6/MAX(H$5:H$24)*H$2,\"00\"))","v":{"$error":"#VALUE!"}},"00","00","00",{"$f":"H34+I34+J34+K34","v":{"$error":"#VALUE!"}},{"$f":"IF(M$1=\"M\",MIN(M$5:M$24)/M6*M$2,IF(M$1=\"R\",M6/MAX(M$5:M$24)*M$2,\"00\"))","v":{"$error":"#VALUE!"}},"00","00","00",{"$f":"M34+N34+O34+P34","v":{"$error":"#VALUE!"}},{"$f":"IF(R$1=\"M\",MIN(R$5:R$24)/R6*R$2,IF(R$1=\"R\",R6/MAX(R$5:R$24)*R$2,\"00\"))","v":{"$error":"#VALUE!"}},"00","00","00",{"$f":"R34+S34+T34+U34","v":{"$error":"#VALUE!"}},{"$f":"IF(W$1=\"M\",MIN(W$5:W$24)/W6*W$2,IF(W$1=\"R\",W6/MAX(W$5:W$24)*W$2,\"00\"))","v":{"$error":"#VALUE!"}},"00","00","00",{"$f":"W34+X34+Y34+Z34","v":{"$error":"#VALUE!"}},{"$f":"IF(AB$1=\"M\",MIN(AB$5:AB$24)/AB6*AB$2,IF(AB$1=\"R\",AB6/MAX(AB$5:AB$24)*AB$2,\"00\"))","v":{"$error":"#VALUE!"}},"00","00","00",{"$f":"AB34+AC34+AD34+AE34","v":{"$error":"#VALUE!"}},{"$f":"IF(AG$1=\"M\",MIN(AG$5:AG$24)/AG6*AG$2,IF(AG$1=\"R\",AG6/MAX(AG$5:AG$24)*AG$2,\"00\"))","v":{"$error":"#VALUE!"}},"00","00","00",{"$f":"AG34+AH34+AI34+AJ34","v":{"$error":"#VALUE!"}},{"$f":"IF(AL$1=\"M\",MIN(AL$5:AL$24)/AL6*AL$2,IF(AL$1=\"R\",AL6/MAX(AL$5:AL$24)*AL$2,\"00\"))","v":{"$error":"#VALUE!"}},"00","00","00",{"$f":"AL34+AM34+AN34+AO34","v":{"$error":"#VALUE!"}},{"$f":"IF(AQ$1=\"M\",MIN(AQ$5:AQ$24)/AQ6*AQ$2,IF(AQ$1=\"R\",AQ6/MAX(AQ$5:AQ$24)*AQ$2,\"00\"))","v":{"$error":"#VALUE!"}},"00","00","00",{"$f":"AQ34+AR34+AS34+AT34","v":{"$error":"#VALUE!"}}]
[3,{"$f":"Zestawienie!B12","v":"IMMOQEE Sp. z o.o.\nul. Karola Chodkiewicza 3 lok. U 10\n02-593 Warszawa"},{"$f":"IF(C$1=\"M\",MIN(C$5:C$24)/C7*C$2,IF(C$1=\"R\",C7/MAX(C$5:C$24)*C$2,\"00\"))","v":{"v":25.78205128205128,"d":"25.8"}},{"v":3.961703532518983,"d":"4.0"},{"v":3.333333333333333,"d":"3.3"},"00",{"v":33.077088147903595,"d":"33.1"},{"$f":"IF(H$1=\"M\",MIN(H$5:H$24)/H7*H$2,IF(H$1=\"R\",H7/MAX(H$5:H$24)*H$2,\"00\"))","v":{"$error":"#VALUE!"}},"00","00","00",{"$error":"#VALUE!"},{"$f":"IF(M$1=\"M\",MIN(M$5:M$24)/M7*M$2,IF(M$1=\"R\",M7/MAX(M$5:M$24)*M$2,\"00\"))","v":{"$error":"#VALUE!"}},"00","00","00",{"$error":"#VALUE!"},{"$f":"IF(R$1=\"M\",MIN(R$5:R$24)/R7*R$2,IF(R$1=\"R\",R7/MAX(R$5:R$24)*R$2,\"00\"))","v":{"$error":"#VALUE!"}},"00","00","00",{"$error":"#VALUE!"},{"$f":"IF(W$1=\"M\",MIN(W$5:W$24)/W7*W$2,IF(W$1=\"R\",W7/MAX(W$5:W$24)*W$2,\"00\"))","v":{"$error":"#VALUE!"}},"00","00","00",{"$error":"#VALUE!"},{"$f":"IF(AB$1=\"M\",MIN(AB$5:AB$24)/AB7*AB$2,IF(AB$1=\"R\",AB7/MAX(AB$5:AB$24)*AB$2,\"00\"))","v":{"$error":"#VALUE!"}},"00","00","00",{"$error":"#VALUE!"},{"$f":"IF(AG$1=\"M\",MIN(AG$5:AG$24)/AG7*AG$2,IF(AG$1=\"R\",AG7/MAX(AG$5:AG$24)*AG$2,\"00\"))","v":{"$error":"#VALUE!"}},"00","00","00",{"$error":"#VALUE!"},{"$f":"IF(AL$1=\"M\",MIN(AL$5:AL$24)/AL7*AL$2,IF(AL$1=\"R\",AL7/MAX(AL$5:AL$24)*AL$2,\"00\"))","v":{"$error":"#VALUE!"}},"00","00","00",{"$error":"#VALUE!"},{"$f":"IF(AQ$1=\"M\",MIN(AQ$5:AQ$24)/AQ7*AQ$2,IF(AQ$1=\"R\",AQ7/MAX(AQ$5:AQ$24)*AQ$2,\"00\"))","v":{"$error":"#VALUE!"}},"00","00","00",{"$error":"#VALUE!"}]
[4,{"$f":"Zestawienie!B13","v":"Brainstorm Group Sp. z o.o. \nul. Perła 10\n41-300 Dabrowa Górnicza"},{"$f":"IF(C$1=\"M\",MIN(C$5:C$24)/C8*C$2,IF(C$1=\"R\",C8/MAX(C$5:C$24)*C$2,\"00\"))","v":{"v":6.812330623306233,"d":"6.8"}},{"v":12.651039947177287,"d":"12.7"},{"v":10,"d":"10.0"},"00",{"v":29.46337057048352,"d":"29.5"},{"$f":"IF(H$1=\"M\",MIN(H$5:H$24)/H8*H$2,IF(H$1=\"R\",H8/MAX(H$5:H$24)*H$2,\"00\"))","v":{"$error":"#VALUE!"}},"00","00","00",{"$error":"#VALUE!"},{"$f":"IF(M$1=\"M\",MIN(M$5:M$24)/M8*M$2,IF(M$1=\"R\",M8/MAX(M$5:M$24)*M$2,\"00\"))","v":{"$error":"#VALUE!"}},"00","00","00",{"$error":"#VALUE!"},{"$f":"IF(R$1=\"M\",MIN(R$5:R$24)/R8*R$2,IF(R$1=\"R\",R8/MAX(R$5:R$24)*R$2,\"00\"))","v":{"$error":"#VALUE!"}},"00","00","00",{"$error":"#VALUE!"},{"$f":"IF(W$1=\"M\",MIN(W$5:W$24)/W8*W$2,IF(W$1=\"R\",W8/MAX(W$5:W$24)*W$2,\"00\"))","v":{"$error":"#VALUE!"}},"00","00","00",{"$error":"#VALUE!"},{"$f":"IF(AB$1=\"M\",MIN(AB$5:AB$24)/AB8*AB$2,IF(AB$1=\"R\",AB8/MAX(AB$5:AB$24)*AB$2,\"00\"))","v":{"$error":"#VALUE!"}},"00","00","00",{"$error":"#VALUE!"},{"$f":"IF(AG$1=\"M\",MIN(AG$5:AG$24)/AG8*AG$2,IF(AG$1=\"R\",AG8/MAX(AG$5:AG$24)*AG$2,\"00\"))","v":{"$error":"#VALUE!"}},"00","00","00",{"$error":"#VALUE!"},{"$f":"IF(AL$1=\"M\",MIN(AL$5:AL$24)/AL8*AL$2,IF(AL$1=\"R\",AL8/MAX(AL$5:AL$24)*AL$2,\"00\"))","v":{"$error":"#VALUE!"}},"00","00","00",{"$error":"#VALUE!"},{"$f":"IF(AQ$1=\"M\",MIN(AQ$5:AQ$24)/AQ8*AQ$2,IF(AQ$1=\"R\",AQ8/MAX(AQ$5:AQ$24)*AQ$2,\"00\"))","v":{"$error":"#VALUE!"}},"00","00","00",{"$error":"#VALUE!"}]
[5,{"$f":"Zestawienie!B14","v":"Slow Life&Business\nul. Szafirowa  78\n63-460 Nowe Skalmierzyce"},{"$f":"IF(C$1=\"M\",MIN(C$5:C$24)/C9*C$2,IF(C$1=\"R\",C9/MAX(C$5:C$24)*C$2,\"00\"))","v":{"$error":"#VALUE!"}},{"v":3.7636183558930343,"d":"3.8"},{"$error":"#VALUE!"},"00",{"$error":"#VALUE!"},{"$f":"IF(H$1=\"M\",MIN(H$5:H$24)/H9*H$2,IF(H$1=\"R\",H9/MAX(H$5:H$24)*H$2,\"00\"))","v":{"$error":"#VALUE!"}},"00","00","00",{"$error":"#VALUE!"},{"$f":"IF(M$1=\"M\",MIN(M$5:M$24)/M9*M$2,IF(M$1=\"R\",M9/MAX(M$5:M$24)*M$2,\"00\"))","v":{"$error":"#VALUE!"}},"00","00","00",{"$error":"#VALUE!"},{"$f":"IF(R$1=\"M\",MIN(R$5:R$24)/R9*R$2,IF(R$1=\"R\",R9/MAX(R$5:R$24)*R$2,\"00\"))","v":{"$error":"#VALUE!"}},"00","00","00",{"$error":"#VALUE!"},{"$f":"IF(W$1=\"M\",MIN(W$5:W$24)/W9*W$2,IF(W$1=\"R\",W9/MAX(W$5:W$24)*W$2,\"00\"))","v":{"$error":"#VALUE!"}},"00","00","00",{"$error":"#VALUE!"},{"$f":"IF(AB$1=\"M\",MIN(AB$5:AB$24)/AB9*AB$2,IF(AB$1=\"R\",AB9/MAX(AB$5:AB$24)*AB$2,\"00\"))","v":{"$error":"#VALUE!"}},"00","00","00",{"$error":"#VALUE!"},{"$f":"IF(AG$1=\"M\",MIN(AG$5:AG$24)/AG9*AG$2,IF(AG$1=\"R\",AG9/MAX(AG$5:AG$24)*AG$2,\"00\"))","v":{"$error":"#VALUE!"}},"00","00","00",{"$error":"#VALUE!"},{"$f":"IF(AL$1=\"M\",MIN(AL$5:AL$24)/AL9*AL$2,IF(AL$1=\"R\",AL9/MAX(AL$5:AL$24)*AL$2,\"00\"))","v":{"$error":"#VALUE!"}},"00","00","00",{"$error":"#VALUE!"},{"$f":"IF(AQ$1=\"M\",MIN(AQ$5:AQ$24)/AQ9*AQ$2,IF(AQ$1=\"R\",AQ9/MAX(AQ$5:AQ$24)*AQ$2,\"00\"))","v":{"$error":"#VALUE!"}},"00","00","00",{"$error":"#VALUE!"}]
[6,{"$f":"Zestawienie!B15","v":"RAJOS COSULTING Rafał Stelmasik\nul. C.K.Norwida 1\n37-550 Radymno"},{"$f":"IF(C$1=\"M\",MIN(C$5:C$24)/C10*C$2,IF(C$1=\"R\",C10/MAX(C$5:C$24)*C$2,\"00\"))","v":{"v":46.208639705882355,"d":"46.2"}},{"v":1.9808517662594916,"d":"2.0"},{"v":3.333333333333333,"d":"3.3"},"00",{"v":51.52282480547518,"d":"51.5"},{"$f":"IF(H$1=\"M\",MIN(H$5:H$24)/H10*H$2,IF(H$1=\"R\",H10/MAX(H$5:H$24)*H$2,\"00\"))","v":{"$error":"#VALUE!"}},"00","00","00",{"$error":"#VALUE!"},{"$f":"IF(M$1=\"M\",MIN(M$5:M$24)/M10*M$2,IF(M$1=\"R\",M10/MAX(M$5:M$24)*M$2,\"00\"))","v":{"$error":"#VALUE!"}},"00","00","00",{"$error":"#VALUE!"},{"$f":"IF(R$1=\"M\",MIN(R$5:R$24)/R10*R$2,IF(R$1=\"R\",R10/MAX(R$5:R$24)*R$2,\"00\"))","v":{"$error":"#VALUE!"}},"00","00","00",{"$error":"#VALUE!"},{"$f":"IF(W$1=\"M\",MIN(W$5:W$24)/W10*W$2,IF(W$1=\"R\",W10/MAX(W$5:W$24)*W$2,\"00\"))","v":{"$error":"#VALUE!"}},"00","00","00",{"$error":"#VALUE!"},{"$f":"IF(AB$1=\"M\",MIN(AB$5:AB$24)/AB10*AB$2,IF(AB$1=\"R\",AB10/MAX(AB$5:AB$24)*AB$2,\"00\"))","v":{"$error":"#VALUE!"}},"00","00","00",{"$error":"#VALUE!"},{"$f":"IF(AG$1=\"M\",MIN(AG$5:AG$24)/AG10*AG$2,IF(AG$1=\"R\",AG10/MAX(AG$5:AG$24)*AG$2,\"00\"))","v":{"$error":"#VALUE!"}},"00","00","00",{"$error":"#VALUE!"},{"$f":"IF(AL$1=\"M\",MIN(AL$5:AL$24)/AL10*AL$2,IF(AL$1=\"R\",AL10/MAX(AL$5:AL$24)*AL$2,\"00\"))","v":{"$error":"#VALUE!"}},"00","00","00",{"$error":"#VALUE!"},{"$f":"IF(AQ$1=\"M\",MIN(AQ$5:AQ$24)/AQ10*AQ$2,IF(AQ$1=\"R\",AQ10/MAX(AQ$5:AQ$24)*AQ$2,\"00\"))","v":{"$error":"#VALUE!"}},"00","00","00",{"$error":"#VALUE!"}]
[7,{"$f":"Zestawienie!B16","v":"Centrum Szkoleń Wielozawodowych DELTA\nul. Sandomierska 26a pokój nr 9\n27-400 Ostrowiec w."},{"$f":"IF(C$1=\"M\",MIN(C$5:C$24)/C11*C$2,IF(C$1=\"R\",C11/MAX(C$5:C$24)*C$2,\"00\"))","v":{"v":50,"d":"50.0"}},{"v":1.9808517662594916,"d":"2.0"},{"v":5,"d":"5.0"},"00",{"v":56.98085176625949,"d":"57.0"},{"$f":"IF(H$1=\"M\",MIN(H$5:H$24)/H11*H$2,IF(H$1=\"R\",H11/MAX(H$5:H$24)*H$2,\"00\"))","v":{"$error":"#VALUE!"}},"00","00","00",{"$error":"#VALUE!"},{"$f":"IF(M$1=\"M\",MIN(M$5:M$24)/M11*M$2,IF(M$1=\"R\",M11/MAX(M$5:M$24)*M$2,\"00\"))","v":{"$error":"#VALUE!"}},"00","00","00",{"$error":"#VALUE!"},{"$f":"IF(R$1=\"M\",MIN(R$5:R$24)/R11*R$2,IF(R$1=\"R\",R11/MAX(R$5:R$24)*R$2,\"00\"))","v":{"$error":"#VALUE!"}},"00","00","00",{"$error":"#VALUE!"},{"$f":"IF(W$1=\"M\",MIN(W$5:W$24)/W11*W$2,IF(W$1=\"R\",W11/MAX(W$5:W$24)*W$2,\"00\"))","v":{"$error":"#VALUE!"}},"00","00","00",{"$error":"#VALUE!"},{"$f":"IF(AB$1=\"M\",MIN(AB$5:AB$24)/AB11*AB$2,IF(AB$1=\"R\",AB11/MAX(AB$5:AB$24)*AB$2,\"00\"))","v":{"$error":"#VALUE!"}},"00","00","00",{"$error":"#VALUE!"},{"$f":"IF(AG$1=\"M\",MIN(AG$5:AG$24)/AG11*AG$2,IF(AG$1=\"R\",AG11/MAX(AG$5:AG$24)*AG$2,\"00\"))","v":{"$error":"#VALUE!"}},"00","00","00",{"$error":"#VALUE!"},{"$f":"IF(AL$1=\"M\",MIN(AL$5:AL$24)/AL11*AL$2,IF(AL$1=\"R\",AL11/MAX(AL$5:AL$24)*AL$2,\"00\"))","v":{"$error":"#VALUE!"}},"00","00","00",{"$error":"#VALUE!"},{"$f":"IF(AQ$1=\"M\",MIN(AQ$5:AQ$24)/AQ11*AQ$2,IF(AQ$1=\"R\",AQ11/MAX(AQ$5:AQ$24)*AQ$2,\"00\"))","v":{"$error":"#VALUE!"}},"00","00","00",{"$error":"#VALUE!"}]
[8,{"$f":"Zestawienie!B17","v":"Coach and Go Joanna Chorwacka\nul. Sosnowa 6d\n86-300 Grudziądz"},{"$f":"IF(C$1=\"M\",MIN(C$5:C$24)/C12*C$2,IF(C$1=\"R\",C12/MAX(C$5:C$24)*C$2,\"00\"))","v":{"v":31.421875,"d":"31.4"}},{"v":3.301419610432486,"d":"3.3"},{"v":5,"d":"5.0"},"00",{"v":39.72329461043249,"d":"39.7"},{"$f":"IF(H$1=\"M\",MIN(H$5:H$24)/H12*H$2,IF(H$1=\"R\",H12/MAX(H$5:H$24)*H$2,\"00\"))","v":{"$error":"#VALUE!"}},"00","00","00",{"$error":"#VALUE!"},{"$f":"IF(M$1=\"M\",MIN(M$5:M$24)/M12*M$2,IF(M$1=\"R\",M12/MAX(M$5:M$24)*M$2,\"00\"))","v":{"$error":"#VALUE!"}},"00","00","00",{"$error":"#VALUE!"},{"$f":"IF(R$1=\"M\",MIN(R$5:R$24)/R12*R$2,IF(R$1=\"R\",R12/MAX(R$5:R$24)*R$2,\"00\"))","v":{"$error":"#VALUE!"}},"00","00","00",{"$error":"#VALUE!"},{"$f":"IF(W$1=\"M\",MIN(W$5:W$24)/W12*W$2,IF(W$1=\"R\",W12/MAX(W$5:W$24)*W$2,\"00\"))","v":{"$error":"#VALUE!"}},"00","00","00",{"$error":"#VALUE!"},{"$f":"IF(AB$1=\"M\",MIN(AB$5:AB$24)/AB12*AB$2,IF(AB$1=\"R\",AB12/MAX(AB$5:AB$24)*AB$2,\"00\"))","v":{"$error":"#VALUE!"}},"00","00","00",{"$error":"#VALUE!"},{"$f":"IF(AG$1=\"M\",MIN(AG$5:AG$24)/AG12*AG$2,IF(AG$1=\"R\",AG12/MAX(AG$5:AG$24)*AG$2,\"00\"))","v":{"$error":"#VALUE!"}},"00","00","00",{"$error":"#VALUE!"},{"$f":"IF(AL$1=\"M\",MIN(AL$5:AL$24)/AL12*AL$2,IF(AL$1=\"R\",AL12/MAX(AL$5:AL$24)*AL$2,\"00\"))","v":{"$error":"#VALUE!"}},"00","00","00",{"$error":"#VALUE!"},{"$f":"IF(AQ$1=\"M\",MIN(AQ$5:AQ$24)/AQ12*AQ$2,IF(AQ$1=\"R\",AQ12/MAX(AQ$5:AQ$24)*AQ$2,\"00\"))","v":{"$error":"#VALUE!"}},"00","00","00",{"$error":"#VALUE!"}]
[9,{"$f":"Zestawienie!B18","v":"Moja Firma Elzbieta Kowalska\nul. Uniwersytecka 33/35 lok. 36\n90-233 Łódź"},{"$f":"IF(C$1=\"M\",MIN(C$5:C$24)/C13*C$2,IF(C$1=\"R\",C13/MAX(C$5:C$24)*C$2,\"00\"))","v":{"v":15.7109375,"d":"15.7"}},{"v":20.059425552987786,"d":"20.1"},{"v":10,"d":"10.0"},"00",{"v":45.77036305298779,"d":"45.8"},{"$f":"IF(H$1=\"M\",MIN(H$5:H$24)/H13*H$2,IF(H$1=\"R\",H13/MAX(H$5:H$24)*H$2,\"00\"))","v":{"$error":"#VALUE!"}},"00","00","00",{"$error":"#VALUE!"},{"$f":"IF(M$1=\"M\",MIN(M$5:M$24)/M13*M$2,IF(M$1=\"R\",M13/MAX(M$5:M$24)*M$2,\"00\"))","v":{"$error":"#VALUE!"}},"00","00","00",{"$error":"#VALUE!"},{"$f":"IF(R$1=\"M\",MIN(R$5:R$24)/R13*R$2,IF(R$1=\"R\",R13/MAX(R$5:R$24)*R$2,\"00\"))","v":{"$error":"#VALUE!"}},"00","00","00",{"$error":"#VALUE!"},{"$f":"IF(W$1=\"M\",MIN(W$5:W$24)/W13*W$2,IF(W$1=\"R\",W13/MAX(W$5:W$24)*W$2,\"00\"))","v":{"$error":"#VALUE!"}},"00","00","00",{"$error":"#VALUE!"},{"$f":"IF(AB$1=\"M\",MIN(AB$5:AB$24)/AB13*AB$2,IF(AB$1=\"R\",AB13/MAX(AB$5:AB$24)*AB$2,\"00\"))","v":{"$error":"#VALUE!"}},"00","00","00",{"$error":"#VALUE!"},{"$f":"IF(AG$1=\"M\",MIN(AG$5:AG$24)/AG13*AG$2,IF(AG$1=\"R\",AG13/MAX(AG$5:AG$24)*AG$2,\"00\"))","v":{"$error":"#VALUE!"}},"00","00","00",{"$error":"#VALUE!"},{"$f":"IF(AL$1=\"M\",MIN(AL$5:AL$24)/AL13*AL$2,IF(AL$1=\"R\",AL13/MAX(AL$5:AL$24)*AL$2,\"00\"))","v":{"$error":"#VALUE!"}},"00","00","00",{"$error":"#VALUE!"},{"$f":"IF(AQ$1=\"M\",MIN(AQ$5:AQ$24)/AQ13*AQ$2,IF(AQ$1=\"R\",AQ13/MAX(AQ$5:AQ$24)*AQ$2,\"00\"))","v":{"$error":"#VALUE!"}},"00","00","00",{"$error":"#VALUE!"}]
[10,{"$f":"Zestawienie!B19","v":"LCE LOGOS Centrum Edukacyjne\nul. Ks.Kard.Wyszyńskiego 6 lok 44\n18-400 Łomża"},{"$f":"IF(C$1=\"M\",MIN(C$5:C$24)/C14*C$2,IF(C$1=\"R\",C14/MAX(C$5:C$24)*C$2,\"00\"))","v":{"v":41.34457236842105,"d":"41.3"}},{"v":6.087817761637504,"d":"6.1"},{"v":10,"d":"10.0"},"00",{"v":57.43239013005855,"d":"57.4"},{"$f":"IF(H$1=\"M\",MIN(H$5:H$24)/H14*H$2,IF(H$1=\"R\",H14/MAX(H$5:H$24)*H$2,\"00\"))","v":{"$error":"#VALUE!"}},"00","00","00",{"$error":"#VALUE!"},{"$f":"IF(M$1=\"M\",MIN(M$5:M$24)/M14*M$2,IF(M$1=\"R\",M14/MAX(M$5:M$24)*M$2,\"00\"))","v":{"$error":"#VALUE!"}},"00","00","00",{"$error":"#VALUE!"},{"$f":"IF(R$1=\"M\",MIN(R$5:R$24)/R14*R$2,IF(R$1=\"R\",R14/MAX(R$5:R$24)*R$2,\"00\"))","v":{"$error":"#VALUE!"}},"00","00","00",{"$error":"#VALUE!"},{"$f":"IF(W$1=\"M\",MIN(W$5:W$24)/W14*W$2,IF(W$1=\"R\",W14/MAX(W$5:W$24)*W$2,\"00\"))","v":{"$error":"#VALUE!"}},"00","00","00",{"$error":"#VALUE!"},{"$f":"IF(AB$1=\"M\",MIN(AB$5:AB$24)/AB14*AB$2,IF(AB$1=\"R\",AB14/MAX(AB$5:AB$24)*AB$2,\"00\"))","v":{"$error":"#VALUE!"}},"00","00","00",{"$error":"#VALUE!"},{"$f":"IF(AG$1=\"M\",MIN(AG$5:AG$24)/AG14*AG$2,IF(AG$1=\"R\",AG14/MAX(AG$5:AG$24)*AG$2,\"00\"))","v":{"$error":"#VALUE!"}},"00","00","00",{"$error":"#VALUE!"},{"$f":"IF(AL$1=\"M\",MIN(AL$5:AL$24)/AL14*AL$2,IF(AL$1=\"R\",AL14/MAX(AL$5:AL$24)*AL$2,\"00\"))","v":{"$error":"#VALUE!"}},"00","00","00",{"$error":"#VALUE!"},{"$f":"IF(AQ$1=\"M\",MIN(AQ$5:AQ$24)/AQ14*AQ$2,IF(AQ$1=\"R\",AQ14/MAX(AQ$5:AQ$24)*AQ$2,\"00\"))","v":{"$error":"#VALUE!"}},"00","00","00",{"$error":"#VALUE!"}]
[11,{"$f":"Zestawienie!B20","v":"SEKA S.A. \nul. Bernardyńska 13\n85-029 Bydgoszcz"},{"$f":"IF(C$1=\"M\",MIN(C$5:C$24)/C15*C$2,IF(C$1=\"R\",C15/MAX(C$5:C$24)*C$2,\"00\"))","v":{"v":28.72857142857143,"d":"28.7"}},{"v":20.165070980521623,"d":"20.2"},{"v":10,"d":"10.0"},"00",{"v":58.893642409093054,"d":"58.9"},{"$f":"IF(H$1=\"M\",MIN(H$5:H$24)/H15*H$2,IF(H$1=\"R\",H15/MAX(H$5:H$24)*H$2,\"00\"))","v":{"$error":"#VALUE!"}},"00","00","00",{"$error":"#VALUE!"},{"$f":"IF(M$1=\"M\",MIN(M$5:M$24)/M15*M$2,IF(M$1=\"R\",M15/MAX(M$5:M$24)*M$2,\"00\"))","v":{"$error":"#VALUE!"}},"00","00","00",{"$error":"#VALUE!"},{"$f":"IF(R$1=\"M\",MIN(R$5:R$24)/R15*R$2,IF(R$1=\"R\",R15/MAX(R$5:R$24)*R$2,\"00\"))","v":{"$error":"#VALUE!"}},"00","00","00",{"$error":"#VALUE!"},{"$f":"IF(W$1=\"M\",MIN(W$5:W$24)/W15*W$2,IF(W$1=\"R\",W15/MAX(W$5:W$24)*W$2,\"00\"))","v":{"$error":"#VALUE!"}},"00","00","00",{"$error":"#VALUE!"},{"$f":"IF(AB$1=\"M\",MIN(AB$5:AB$24)/AB15*AB$2,IF(AB$1=\"R\",AB15/MAX(AB$5:AB$24)*AB$2,\"00\"))","v":{"$error":"#VALUE!"}},"00","00","00",{"$error":"#VALUE!"},{"$f":"IF(AG$1=\"M\",MIN(AG$5:AG$24)/AG15*AG$2,IF(AG$1=\"R\",AG15/MAX(AG$5:AG$24)*AG$2,\"00\"))","v":{"$error":"#VALUE!"}},"00","00","00",{"$error":"#VALUE!"},{"$f":"IF(AL$1=\"M\",MIN(AL$5:AL$24)/AL15*AL$2,IF(AL$1=\"R\",AL15/MAX(AL$5:AL$24)*AL$2,\"00\"))","v":{"$error":"#VALUE!"}},"00","00","00",{"$error":"#VALUE!"},{"$f":"IF(AQ$1=\"M\",MIN(AQ$5:AQ$24)/AQ15*AQ$2,IF(AQ$1=\"R\",AQ15/MAX(AQ$5:AQ$24)*AQ$2,\"00\"))","v":{"$error":"#VALUE!"}},"00","00","00",{"$error":"#VALUE!"}]
[12,{"$f":"Zestawienie!B21","v":"Polska Akademia Oświaty Sp. z o.o.\nul. Krańcowa 17/1\n02-493 Warszawa"},{"$f":"IF(C$1=\"M\",MIN(C$5:C$24)/C16*C$2,IF(C$1=\"R\",C16/MAX(C$5:C$24)*C$2,\"00\"))","v":{"v":15.7109375,"d":"15.7"}},{"v":40,"d":"40.0"},{"v":10,"d":"10.0"},"00",{"v":65.7109375,"d":"65.7"},{"$f":"IF(H$1=\"M\",MIN(H$5:H$24)/H16*H$2,IF(H$1=\"R\",H16/MAX(H$5:H$24)*H$2,\"00\"))","v":{"$error":"#VALUE!"}},"00","00","00",{"$error":"#VALUE!"},{"$f":"IF(M$1=\"M\",MIN(M$5:M$24)/M16*M$2,IF(M$1=\"R\",M16/MAX(M$5:M$24)*M$2,\"00\"))","v":{"$error":"#VALUE!"}},"00","00","00",{"$error":"#VALUE!"},{"$f":"IF(R$1=\"M\",MIN(R$5:R$24)/R16*R$2,IF(R$1=\"R\",R16/MAX(R$5:R$24)*R$2,\"00\"))","v":{"$error":"#VALUE!"}},"00","00","00",{"$error":"#VALUE!"},{"$f":"IF(W$1=\"M\",MIN(W$5:W$24)/W16*W$2,IF(W$1=\"R\",W16/MAX(W$5:W$24)*W$2,\"00\"))","v":{"$error":"#VALUE!"}},"00","00","00",{"$error":"#VALUE!"},{"$f":"IF(AB$1=\"M\",MIN(AB$5:AB$24)/AB16*AB$2,IF(AB$1=\"R\",AB16/MAX(AB$5:AB$24)*AB$2,\"00\"))","v":{"$error":"#VALUE!"}},"00","00","00",{"$error":"#VALUE!"},{"$f":"IF(AG$1=\"M\",MIN(AG$5:AG$24)/AG16*AG$2,IF(AG$1=\"R\",AG16/MAX(AG$5:AG$24)*AG$2,\"00\"))","v":{"$error":"#VALUE!"}},"00","00","00",{"$error":"#VALUE!"},{"$f":"IF(AL$1=\"M\",MIN(AL$5:AL$24)/AL16*AL$2,IF(AL$1=\"R\",AL16/MAX(AL$5:AL$24)*AL$2,\"00\"))","v":{"$error":"#VALUE!"}},"00","00","00",{"$error":"#VALUE!"},{"$f":"IF(AQ$1=\"M\",MIN(AQ$5:AQ$24)/AQ16*AQ$2,IF(AQ$1=\"R\",AQ16/MAX(AQ$5:AQ$24)*AQ$2,\"00\"))","v":{"$error":"#VALUE!"}},"00","00","00",{"$error":"#VALUE!"}]
[13,{"$f":"Zestawienie!B22","v":"0\n0\n0"},{"$f":"IF(C$1=\"M\",MIN(C$5:C$24)/C17*C$2,IF(C$1=\"R\",C17/MAX(C$5:C$24)*C$2,\"00\"))","v":{"$error":"#VALUE!"}},{"$error":"#VALUE!"},{"$error":"#VALUE!"},"00",{"$error":"#VALUE!"},{"$f":"IF(H$1=\"M\",MIN(H$5:H$24)/H17*H$2,IF(H$1=\"R\",H17/MAX(H$5:H$24)*H$2,\"00\"))","v":{"$error":"#VALUE!"}},"00","00","00",{"$error":"#VALUE!"},{"$f":"IF(M$1=\"M\",MIN(M$5:M$24)/M17*M$2,IF(M$1=\"R\",M17/MAX(M$5:M$24)*M$2,\"00\"))","v":{"$error":"#VALUE!"}},"00","00","00",{"$error":"#VALUE!"},{"$f":"IF(R$1=\"M\",MIN(R$5:R$24)/R17*R$2,IF(R$1=\"R\",R17/MAX(R$5:R$24)*R$2,\"00\"))","v":{"$error":"#VALUE!"}},"00","00","00",{"$error":"#VALUE!"},{"$f":"IF(W$1=\"M\",MIN(W$5:W$24)/W17*W$2,IF(W$1=\"R\",W17/MAX(W$5:W$24)*W$2,\"00\"))","v":{"$error":"#VALUE!"}},"00","00","00",{"$error":"#VALUE!"},{"$f":"IF(AB$1=\"M\",MIN(AB$5:AB$24)/AB17*AB$2,IF(AB$1=\"R\",AB17/MAX(AB$5:AB$24)*AB$2,\"00\"))","v":{"$error":"#VALUE!"}},"00","00","00",{"$error":"#VALUE!"},{"$f":"IF(AG$1=\"M\",MIN(AG$5:AG$24)/AG17*AG$2,IF(AG$1=\"R\",AG17/MAX(AG$5:AG$24)*AG$2,\"00\"))","v":{"$error":"#VALUE!"}},"00","00","00",{"$error":"#VALUE!"},{"$f":"IF(AL$1=\"M\",MIN(AL$5:AL$24)/AL17*AL$2,IF(AL$1=\"R\",AL17/MAX(AL$5:AL$24)*AL$2,\"00\"))","v":{"$error":"#VALUE!"}},"00","00","00",{"$error":"#VALUE!"},{"$f":"IF(AQ$1=\"M\",MIN(AQ$5:AQ$24)/AQ17*AQ$2,IF(AQ$1=\"R\",AQ17/MAX(AQ$5:AQ$24)*AQ$2,\"00\"))","v":{"$error":"#VALUE!"}},"00","00","00",{"$error":"#VALUE!"}]
[14,{"$f":"Zestawienie!B23","v":"0\n0\n0"},{"$f":"IF(C$1=\"M\",MIN(C$5:C$24)/C18*C$2,IF(C$1=\"R\",C18/MAX(C$5:C$24)*C$2,\"00\"))","v":{"$error":"#VALUE!"}},{"$error":"#VALUE!"},{"$error":"#VALUE!"},"00",{"$error":"#VALUE!"},{"$f":"IF(H$1=\"M\",MIN(H$5:H$24)/H18*H$2,IF(H$1=\"R\",H18/MAX(H$5:H$24)*H$2,\"00\"))","v":{"$error":"#VALUE!"}},"00","00","00",{"$error":"#VALUE!"},{"$f":"IF(M$1=\"M\",MIN(M$5:M$24)/M18*M$2,IF(M$1=\"R\",M18/MAX(M$5:M$24)*M$2,\"00\"))","v":{"$error":"#VALUE!"}},"00","00","00",{"$error":"#VALUE!"},{"$f":"IF(R$1=\"M\",MIN(R$5:R$24)/R18*R$2,IF(R$1=\"R\",R18/MAX(R$5:R$24)*R$2,\"00\"))","v":{"$error":"#VALUE!"}},"00","00","00",{"$error":"#VALUE!"},{"$f":"IF(W$1=\"M\",MIN(W$5:W$24)/W18*W$2,IF(W$1=\"R\",W18/MAX(W$5:W$24)*W$2,\"00\"))","v":{"$error":"#VALUE!"}},"00","00","00",{"$error":"#VALUE!"},{"$f":"IF(AB$1=\"M\",MIN(AB$5:AB$24)/AB18*AB$2,IF(AB$1=\"R\",AB18/MAX(AB$5:AB$24)*AB$2,\"00\"))","v":{"$error":"#VALUE!"}},"00","00","00",{"$error":"#VALUE!"},{"$f":"IF(AG$1=\"M\",MIN(AG$5:AG$24)/AG18*AG$2,IF(AG$1=\"R\",AG18/MAX(AG$5:AG$24)*AG$2,\"00\"))","v":{"$error":"#VALUE!"}},"00","00","00",{"$error":"#VALUE!"},{"$f":"IF(AL$1=\"M\",MIN(AL$5:AL$24)/AL18*AL$2,IF(AL$1=\"R\",AL18/MAX(AL$5:AL$24)*AL$2,\"00\"))","v":{"$error":"#VALUE!"}},"00","00","00",{"$error":"#VALUE!"},{"$f":"IF(AQ$1=\"M\",MIN(AQ$5:AQ$24)/AQ18*AQ$2,IF(AQ$1=\"R\",AQ18/MAX(AQ$5:AQ$24)*AQ$2,\"00\"))","v":{"$error":"#VALUE!"}},"00","00","00",{"$error":"#VALUE!"}]
[15,{"$f":"Zestawienie!B24","v":"0\n0\n0"},{"$f":"IF(C$1=\"M\",MIN(C$5:C$24)/C19*C$2,IF(C$1=\"R\",C19/MAX(C$5:C$24)*C$2,\"00\"))","v":{"$error":"#VALUE!"}},{"$error":"#VALUE!"},{"$error":"#VALUE!"},"00",{"$error":"#VALUE!"},{"$f":"IF(H$1=\"M\",MIN(H$5:H$24)/H19*H$2,IF(H$1=\"R\",H19/MAX(H$5:H$24)*H$2,\"00\"))","v":{"$error":"#VALUE!"}},"00","00","00",{"$error":"#VALUE!"},{"$f":"IF(M$1=\"M\",MIN(M$5:M$24)/M19*M$2,IF(M$1=\"R\",M19/MAX(M$5:M$24)*M$2,\"00\"))","v":{"$error":"#VALUE!"}},"00","00","00",{"$error":"#VALUE!"},{"$f":"IF(R$1=\"M\",MIN(R$5:R$24)/R19*R$2,IF(R$1=\"R\",R19/MAX(R$5:R$24)*R$2,\"00\"))","v":{"$error":"#VALUE!"}},"00","00","00",{"$error":"#VALUE!"},{"$f":"IF(W$1=\"M\",MIN(W$5:W$24)/W19*W$2,IF(W$1=\"R\",W19/MAX(W$5:W$24)*W$2,\"00\"))","v":{"$error":"#VALUE!"}},"00","00","00",{"$error":"#VALUE!"},{"$f":"IF(AB$1=\"M\",MIN(AB$5:AB$24)/AB19*AB$2,IF(AB$1=\"R\",AB19/MAX(AB$5:AB$24)*AB$2,\"00\"))","v":{"$error":"#VALUE!"}},"00","00","00",{"$error":"#VALUE!"},{"$f":"IF(AG$1=\"M\",MIN(AG$5:AG$24)/AG19*AG$2,IF(AG$1=\"R\",AG19/MAX(AG$5:AG$24)*AG$2,\"00\"))","v":{"$error":"#VALUE!"}},"00","00","00",{"$error":"#VALUE!"},{"$f":"IF(AL$1=\"M\",MIN(AL$5:AL$24)/AL19*AL$2,IF(AL$1=\"R\",AL19/MAX(AL$5:AL$24)*AL$2,\"00\"))","v":{"$error":"#VALUE!"}},"00","00","00",{"$error":"#VALUE!"},{"$f":"IF(AQ$1=\"M\",MIN(AQ$5:AQ$24)/AQ19*AQ$2,IF(AQ$1=\"R\",AQ19/MAX(AQ$5:AQ$24)*AQ$2,\"00\"))","v":{"$error":"#VALUE!"}},"00","00","00",{"$error":"#VALUE!"}]
[16,{"$f":"Zestawienie!B25","v":"0\n0\n0"},{"$f":"IF(C$1=\"M\",MIN(C$5:C$24)/C20*C$2,IF(C$1=\"R\",C20/MAX(C$5:C$24)*C$2,\"00\"))","v":{"$error":"#VALUE!"}},{"$error":"#VALUE!"},{"$error":"#VALUE!"},"00",{"$error":"#VALUE!"},{"$f":"IF(H$1=\"M\",MIN(H$5:H$24)/H20*H$2,IF(H$1=\"R\",H20/MAX(H$5:H$24)*H$2,\"00\"))","v":{"$error":"#VALUE!"}},"00","00","00",{"$error":"#VALUE!"},{"$f":"IF(M$1=\"M\",MIN(M$5:M$24)/M20*M$2,IF(M$1=\"R\",M20/MAX(M$5:M$24)*M$2,\"00\"))","v":{"$error":"#VALUE!"}},"00","00","00",{"$error":"#VALUE!"},{"$f":"IF(R$1=\"M\",MIN(R$5:R$24)/R20*R$2,IF(R$1=\"R\",R20/MAX(R$5:R$24)*R$2,\"00\"))","v":{"$error":"#VALUE!"}},"00","00","00",{"$error":"#VALUE!"},{"$f":"IF(W$1=\"M\",MIN(W$5:W$24)/W20*W$2,IF(W$1=\"R\",W20/MAX(W$5:W$24)*W$2,\"00\"))","v":{"$error":"#VALUE!"}},"00","00","00",{"$error":"#VALUE!"},{"$f":"IF(AB$1=\"M\",MIN(AB$5:AB$24)/AB20*AB$2,IF(AB$1=\"R\",AB20/MAX(AB$5:AB$24)*AB$2,\"00\"))","v":{"$error":"#VALUE!"}},"00","00","00",{"$error":"#VALUE!"},{"$f":"IF(AG$1=\"M\",MIN(AG$5:AG$24)/AG20*AG$2,IF(AG$1=\"R\",AG20/MAX(AG$5:AG$24)*AG$2,\"00\"))","v":{"$error":"#VALUE!"}},"00","00","00",{"$error":"#VALUE!"},{"$f":"IF(AL$1=\"M\",MIN(AL$5:AL$24)/AL20*AL$2,IF(AL$1=\"R\",AL20/MAX(AL$5:AL$24)*AL$2,\"00\"))","v":{"$error":"#VALUE!"}},"00","00","00",{"$error":"#VALUE!"},{"$f":"IF(AQ$1=\"M\",MIN(AQ$5:AQ$24)/AQ20*AQ$2,IF(AQ$1=\"R\",AQ20/MAX(AQ$5:AQ$24)*AQ$2,\"00\"))","v":{"$error":"#VALUE!"}},"00","00","00",{"$error":"#VALUE!"}]
[17,{"$f":"Zestawienie!B26","v":"0\n0\n0"},{"$f":"IF(C$1=\"M\",MIN(C$5:C$24)/C21*C$2,IF(C$1=\"R\",C21/MAX(C$5:C$24)*C$2,\"00\"))","v":{"$error":"#VALUE!"}},{"$error":"#VALUE!"},{"$error":"#VALUE!"},"00",{"$error":"#VALUE!"},{"$f":"IF(H$1=\"M\",MIN(H$5:H$24)/H21*H$2,IF(H$1=\"R\",H21/MAX(H$5:H$24)*H$2,\"00\"))","v":{"$error":"#VALUE!"}},"00","00","00",{"$error":"#VALUE!"},{"$f":"IF(M$1=\"M\",MIN(M$5:M$24)/M21*M$2,IF(M$1=\"R\",M21/MAX(M$5:M$24)*M$2,\"00\"))","v":{"$error":"#VALUE!"}},"00","00","00",{"$error":"#VALUE!"},{"$f":"IF(R$1=\"M\",MIN(R$5:R$24)/R21*R$2,IF(R$1=\"R\",R21/MAX(R$5:R$24)*R$2,\"00\"))","v":{"$error":"#VALUE!"}},"00","00","00",{"$error":"#VALUE!"},{"$f":"IF(W$1=\"M\",MIN(W$5:W$24)/W21*W$2,IF(W$1=\"R\",W21/MAX(W$5:W$24)*W$2,\"00\"))","v":{"$error":"#VALUE!"}},"00","00","00",{"$error":"#VALUE!"},{"$f":"IF(AB$1=\"M\",MIN(AB$5:AB$24)/AB21*AB$2,IF(AB$1=\"R\",AB21/MAX(AB$5:AB$24)*AB$2,\"00\"))","v":{"$error":"#VALUE!"}},"00","00","00",{"$error":"#VALUE!"},{"$f":"IF(AG$1=\"M\",MIN(AG$5:AG$24)/AG21*AG$2,IF(AG$1=\"R\",AG21/MAX(AG$5:AG$24)*AG$2,\"00\"))","v":{"$error":"#VALUE!"}},"00","00","00",{"$error":"#VALUE!"},{"$f":"IF(AL$1=\"M\",MIN(AL$5:AL$24)/AL21*AL$2,IF(AL$1=\"R\",AL21/MAX(AL$5:AL$24)*AL$2,\"00\"))","v":{"$error":"#VALUE!"}},"00","00","00",{"$error":"#VALUE!"},{"$f":"IF(AQ$1=\"M\",MIN(AQ$5:AQ$24)/AQ21*AQ$2,IF(AQ$1=\"R\",AQ21/MAX(AQ$5:AQ$24)*AQ$2,\"00\"))","v":{"$error":"#VALUE!"}},"00","00","00",{"$error":"#VALUE!"}]
[18,{"$f":"Zestawienie!B27","v":"0\n0\n0"},{"$f":"IF(C$1=\"M\",MIN(C$5:C$24)/C22*C$2,IF(C$1=\"R\",C22/MAX(C$5:C$24)*C$2,\"00\"))","v":{"$error":"#VALUE!"}},{"$error":"#VALUE!"},{"$error":"#VALUE!"},"00",{"$error":"#VALUE!"},{"$f":"IF(H$1=\"M\",MIN(H$5:H$24)/H22*H$2,IF(H$1=\"R\",H22/MAX(H$5:H$24)*H$2,\"00\"))","v":{"$error":"#VALUE!"}},"00","00","00",{"$error":"#VALUE!"},{"$f":"IF(M$1=\"M\",MIN(M$5:M$24)/M22*M$2,IF(M$1=\"R\",M22/MAX(M$5:M$24)*M$2,\"00\"))","v":{"$error":"#VALUE!"}},"00","00","00",{"$error":"#VALUE!"},{"$f":"IF(R$1=\"M\",MIN(R$5:R$24)/R22*R$2,IF(R$1=\"R\",R22/MAX(R$5:R$24)*R$2,\"00\"))","v":{"$error":"#VALUE!"}},"00","00","00",{"$error":"#VALUE!"},{"$f":"IF(W$1=\"M\",MIN(W$5:W$24)/W22*W$2,IF(W$1=\"R\",W22/MAX(W$5:W$24)*W$2,\"00\"))","v":{"$error":"#VALUE!"}},"00","00","00",{"$error":"#VALUE!"},{"$f":"IF(AB$1=\"M\",MIN(AB$5:AB$24)/AB22*AB$2,IF(AB$1=\"R\",AB22/MAX(AB$5:AB$24)*AB$2,\"00\"))","v":{"$error":"#VALUE!"}},"00","00","00",{"$error":"#VALUE!"},{"$f":"IF(AG$1=\"M\",MIN(AG$5:AG$24)/AG22*AG$2,IF(AG$1=\"R\",AG22/MAX(AG$5:AG$24)*AG$2,\"00\"))","v":{"$error":"#VALUE!"}},"00","00","00",{"$error":"#VALUE!"},{"$f":"IF(AL$1=\"M\",MIN(AL$5:AL$24)/AL22*AL$2,IF(AL$1=\"R\",AL22/MAX(AL$5:AL$24)*AL$2,\"00\"))","v":{"$error":"#VALUE!"}},"00","00","00",{"$error":"#VALUE!"},{"$f":"IF(AQ$1=\"M\",MIN(AQ$5:AQ$24)/AQ22*AQ$2,IF(AQ$1=\"R\",AQ22/MAX(AQ$5:AQ$24)*AQ$2,\"00\"))","v":{"$error":"#VALUE!"}},"00","00","00",{"$error":"#VALUE!"}]
[19,{"$f":"Zestawienie!B28","v":"0\n0\n0"},{"$f":"IF(C$1=\"M\",MIN(C$5:C$24)/C23*C$2,IF(C$1=\"R\",C23/MAX(C$5:C$24)*C$2,\"00\"))","v":{"$error":"#VALUE!"}},{"$error":"#VALUE!"},{"$error":"#VALUE!"},"00",{"$error":"#VALUE!"},{"$f":"IF(H$1=\"M\",MIN(H$5:H$24)/H23*H$2,IF(H$1=\"R\",H23/MAX(H$5:H$24)*H$2,\"00\"))","v":{"$error":"#VALUE!"}},"00","00","00",{"$error":"#VALUE!"},{"$f":"IF(M$1=\"M\",MIN(M$5:M$24)/M23*M$2,IF(M$1=\"R\",M23/MAX(M$5:M$24)*M$2,\"00\"))","v":{"$error":"#VALUE!"}},"00","00","00",{"$error":"#VALUE!"},{"$f":"IF(R$1=\"M\",MIN(R$5:R$24)/R23*R$2,IF(R$1=\"R\",R23/MAX(R$5:R$24)*R$2,\"00\"))","v":{"$error":"#VALUE!"}},"00","00","00",{"$error":"#VALUE!"},{"$f":"IF(W$1=\"M\",MIN(W$5:W$24)/W23*W$2,IF(W$1=\"R\",W23/MAX(W$5:W$24)*W$2,\"00\"))","v":{"$error":"#VALUE!"}},"00","00","00",{"$error":"#VALUE!"},{"$f":"IF(AB$1=\"M\",MIN(AB$5:AB$24)/AB23*AB$2,IF(AB$1=\"R\",AB23/MAX(AB$5:AB$24)*AB$2,\"00\"))","v":{"$error":"#VALUE!"}},"00","00","00",{"$error":"#VALUE!"},{"$f":"IF(AG$1=\"M\",MIN(AG$5:AG$24)/AG23*AG$2,IF(AG$1=\"R\",AG23/MAX(AG$5:AG$24)*AG$2,\"00\"))","v":{"$error":"#VALUE!"}},"00","00","00",{"$error":"#VALUE!"},{"$f":"IF(AL$1=\"M\",MIN(AL$5:AL$24)/AL23*AL$2,IF(AL$1=\"R\",AL23/MAX(AL$5:AL$24)*AL$2,\"00\"))","v":{"$error":"#VALUE!"}},"00","00","00",{"$error":"#VALUE!"},{"$f":"IF(AQ$1=\"M\",MIN(AQ$5:AQ$24)/AQ23*AQ$2,IF(AQ$1=\"R\",AQ23/MAX(AQ$5:AQ$24)*AQ$2,\"00\"))","v":{"$error":"#VALUE!"}},"00","00","00",{"$error":"#VALUE!"}]
[20,{"$f":"Zestawienie!B29","v":"0\n0\n0"},{"$f":"IF(C$1=\"M\",MIN(C$5:C$24)/C24*C$2,IF(C$1=\"R\",C24/MAX(C$5:C$24)*C$2,\"00\"))","v":{"$error":"#VALUE!"}},{"$error":"#VALUE!"},{"$error":"#VALUE!"},"00",{"$error":"#VALUE!"},{"$f":"IF(H$1=\"M\",MIN(H$5:H$24)/H24*H$2,IF(H$1=\"R\",H24/MAX(H$5:H$24)*H$2,\"00\"))","v":{"$error":"#VALUE!"}},"00","00","00",{"$error":"#VALUE!"},{"$f":"IF(M$1=\"M\",MIN(M$5:M$24)/M24*M$2,IF(M$1=\"R\",M24/MAX(M$5:M$24)*M$2,\"00\"))","v":{"$error":"#VALUE!"}},"00","00","00",{"$error":"#VALUE!"},{"$f":"IF(R$1=\"M\",MIN(R$5:R$24)/R24*R$2,IF(R$1=\"R\",R24/MAX(R$5:R$24)*R$2,\"Błąd kryterium\"))","v":{"$error":"#VALUE!"}},"00","00","00",{"$error":"#VALUE!"},{"$f":"IF(W$1=\"M\",MIN(W$5:W$24)/W24*W$2,IF(W$1=\"R\",W24/MAX(W$5:W$24)*W$2,\"00\"))","v":{"$error":"#VALUE!"}},"00","00","00",{"$error":"#VALUE!"},{"$f":"IF(AB$1=\"M\",MIN(AB$5:AB$24)/AB24*AB$2,IF(AB$1=\"R\",AB24/MAX(AB$5:AB$24)*AB$2,\"00\"))","v":{"$error":"#VALUE!"}},"00","00","00",{"$error":"#VALUE!"},{"$f":"IF(AG$1=\"M\",MIN(AG$5:AG$24)/AG24*AG$2,IF(AG$1=\"R\",AG24/MAX(AG$5:AG$24)*AG$2,\"00\"))","v":{"$error":"#VALUE!"}},"00","00","00",{"$error":"#VALUE!"},{"$f":"IF(AL$1=\"M\",MIN(AL$5:AL$24)/AL24*AL$2,IF(AL$1=\"R\",AL24/MAX(AL$5:AL$24)*AL$2,\"00\"))","v":{"$error":"#VALUE!"}},"00","00","00",{"$error":"#VALUE!"},{"$f":"IF(AQ$1=\"M\",MIN(AQ$5:AQ$24)/AQ24*AQ$2,IF(AQ$1=\"R\",AQ24/MAX(AQ$5:AQ$24)*AQ$2,\"00\"))","v":{"$error":"#VALUE!"}},"00","00","00",{"$error":"#VALUE!"}]

{"sheet":"Wykonawcy","index":4,"n_rows":31,"n_cols":4,"rows_kept":31}
["Lp","Nazwa","Ulica","Miasto"]
[1,"Agencja Analiz i Doradztwa Personalnego Remigiusz Koc","ul. Gdańska 105/4","85-022 Bydgoszcz"]
[2,"Brainstorm Group Sp. z o.o. ","ul. Perła 10","41-300 Dabrowa Górnicza"]
[3,"Centrum Szkoleń Wielozawodowych DELTA","ul. Sandomierska 26a pokój nr 9","27-400 Ostrowiec w."]
[4,"Coach and Go Joanna Chorwacka","ul. Sosnowa 6d","86-300 Grudziądz"]
[5,"IMMOQEE Sp. z o.o.","ul. Karola Chodkiewicza 3 lok. U 10","02-593 Warszawa"]
[6,"LCE LOGOS Centrum Edukacyjne","ul. Ks.Kard.Wyszyńskiego 6 lok 44","18-400 Łomża"]
[7,"Moja Firma Elzbieta Kowalska","ul. Uniwersytecka 33/35 lok. 36","90-233 Łódź"]
[8,"Nowoczesny Osrodek Edukacji Anna Ratuszniak","ul. Zaułek Szkolny 24","55-002 Kamieniec Wrocławski"]
[9,"Polska Akademia Oświaty Sp. z o.o.","ul. Krańcowa 17/1","02-493 Warszawa"]
[10,"RAJOS COSULTING Rafał Stelmasik","ul. C.K.Norwida 1","37-550 Radymno"]
[11,"SEKA S.A. ","ul. Bernardyńska 13","85-029 Bydgoszcz"]
[12,"Slow Life&Business","ul. Szafirowa  78","63-460 Nowe Skalmierzyce"]
[13]
[14]
[15]
[16]
[17]
[18]
[19]
[20]
[21]
[22]
[23]
[24]
[25]
[26]
[27]
[28]
[29]
[30]